id,hh_id,country,sec_area,tert_area,round,smpl_weight,sex,age,edc_level,edc,residence,preg_lact,breastfeeding,hh_head,wgt,wgt_method,hgt,hgt_method,bmi_adults,bmi_children,bmi_cat,misrep,pa,pa_cat,smok,special_diet,special_diet_other,clin_diet,clin_diet_other,note,edc_hh,bmi_cat_Cole2012,food_allergy
1000,5672,Finland,2,1,1,,2,3.916666666666667,,,1,,0,,15.625,1,99.3,1,,,,,,,,0,,0,,,3,2,0
1001,5523,Finland,1,2,1,,2,6.333333333333333,,,2,,,,20.805,1,118.7,1,,,,,,,,0,,0,,,3,2,0
1003,5061,Finland,1,2,1,,2,5,,,2,,0,,19.6,1,113,1,,,,,,,,0,,0,,,3,2,0
1004,5022,Finland,1,2,1,,1,4.833333333333333,,,2,,0,,19.14,1,112.3,1,,,,,,,,0,,0,,,3,2,0
1005,5160,Finland,1,2,1,,1,5,,,2,,0,,,,,,,,,,,,,0,,0,,,3,,0
1006,5419,Finland,1,2,1,,2,5.333333333333333,,,2,,,,20.25,1,112.4,1,,,,,,,,0,,0,,,3,2,0
1008,5103,Finland,1,2,1,,1,5.083333333333333,,,2,,,,13.285,1,92.5,1,,,,,,,,0,,0,,,3,2,0
1009,5462,Finland,1,2,1,,1,3.666666666666667,,,1,,0,,17.085,1,101.1,1,,,,,,,,0,,0,,,2,2,0
1010,5757,Finland,1,2,1,,1,4.75,,,2,,0,,19.335,1,108.5,1,,,,,,,,0,,0,,,3,2,0
1011,5085,Finland,1,2,1,,2,4.5,,,2,,0,,16.875,1,104.8,1,,,,,,,,0,,0,,,2,2,0
1012,5622,Finland,1,2,1,,1,4.416666666666667,,,2,,0,,15.21,1,101.9,1,,,,,,,,0,,0,,,3,2,0
1013,5658,Finland,1,2,1,,1,4.583333333333333,,,2,,0,,16.095,1,97.3,1,,,,,,,,0,,0,,,3,2,0
1014,5894,Finland,1,2,1,,1,5,,,2,,0,,20.5,1,112.6,1,,,,,,,,0,,0,,,2,2,0
1015,5544,Finland,1,2,1,,2,6.166666666666667,,,2,,,,21.25,1,120.6,1,,,,,,,,0,,0,,,3,2,0
1017,5835,Finland,1,2,1,,1,5.5,,,2,,,,19.385,1,115,1,,,,,,,,0,,0,,,3,2,0
1018,5287,Finland,1,2,1,,2,6.416666666666667,,,2,,,,21.71,1,124.7,1,,,,,,,,0,,0,,,3,2,0
1019,5710,Finland,1,2,1,,1,5.666666666666667,,,2,,,,20.385,1,114.7,1,,,,,,,,0,,0,,,3,2,0
1021,5739,Finland,1,2,1,,1,4.666666666666667,,,2,,0,,18.535,1,105.7,1,,,,,,,,0,,0,,,3,2,0
1022,5671,Finland,1,2,1,,1,5.333333333333333,,,2,,,,14.585,1,96.09999999999999,1,,,,,,,,0,,0,,,3,2,0
1023,5307,Finland,1,2,1,,1,3.833333333333333,,,2,,0,,17.39,1,104.4,1,,,,,,,,0,,0,,,3,2,0
1026,5990,Finland,1,2,1,,1,4.583333333333333,,,2,,0,,19.755,1,109.3,1,,,,,,,,0,,7,,,3,2,0
1027,5769,Finland,2,1,1,,2,6.083333333333333,,,2,,,,30.36,1,127.1,1,,,,,,,,0,,0,,,3,3,1
1028,5674,Finland,1,2,1,,2,4.833333333333333,,,2,,0,,20.9,1,109.6,1,,,,,,,,0,,0,,,2,3,0
1030,5663,Finland,2,1,1,,1,3.833333333333333,,,2,,0,,17.12,1,102,1,,,,,,,,0,,0,,,3,2,1
1031,5788,Finland,1,2,1,,2,3.166666666666667,,,2,,0,,15.435,1,98.5,1,,,,,,,,0,,0,,,3,2,0
1033,5401,Finland,1,2,1,,2,5.916666666666667,,,2,,,,15.35,1,104.4,1,,,,,,,,0,,0,,,3,2,0
1034,5126,Finland,2,1,1,,2,4.25,,,2,,0,,17.525,1,105.6,1,,,,,,,,0,,0,,,3,2,0
1035,5860,Finland,1,2,1,,2,3.5,,,2,,0,,17,1,107.4,1,,,,,,,,0,,0,,,3,2,0
1036,5700,Finland,1,2,1,,1,3.5,,,2,,0,,14.785,1,100.5,1,,,,,,,,0,,0,,,3,1,0
1038,5019,Finland,1,2,1,,1,5.333333333333333,,,2,,,,19.435,1,115.5,1,,,,,,,,,,,,,3,2,
1040,5405,Finland,1,2,1,,2,5.5,,,2,,,,20.15,1,113.3,1,,,,,,,,0,,0,,,3,2,0
1041,5755,Finland,1,2,1,,1,5.166666666666667,,,2,,,,25.085,1,120.2,1,,,,,,,,0,,0,,,3,2,0
1042,5223,Finland,2,1,1,,1,4.916666666666667,,,2,,0,,20.94,1,111.7,1,,,,,,,,0,,0,,,2,2,0
1043,5792,Finland,1,2,1,,1,4.75,,,2,,0,,34.1,1,125,1,,,,,,,,0,,7,,,2,4,1
1045,5090,Finland,1,2,1,,1,4.666666666666667,,,2,,0,,18.635,1,105,1,,,,,,,,0,,0,,,3,2,0
1047,5354,Finland,1,2,1,,1,4,,,2,,0,,,,,,,,,,,,,0,,0,,,3,,0
1048,5631,Finland,2,1,1,,2,5.666666666666667,,,2,,,,18.36,1,114.4,1,,,,,,,,0,,0,,,3,2,0
1050,5802,Finland,1,2,1,,1,4.5,,,2,,0,,18.51,1,108.7,1,,,,,,,,0,,0,,,3,2,0
1051,5141,Finland,1,2,1,,2,5.833333333333333,,,2,,,,20.915,1,119.9,1,,,,,,,,0,,0,,,2,2,0
1052,5077,Finland,1,2,1,,1,4.5,,,2,,0,,17.435,1,105.1,1,,,,,,,,0,,0,,,3,2,0
1053,5348,Finland,1,2,1,,1,4.666666666666667,,,2,,0,,17.01,1,108.9,1,,,,,,,,0,,0,,,3,2,0
1054,5079,Finland,1,2,1,,1,3.333333333333333,,,2,,0,,,,,,,,,,,,,0,,7,,,3,,1
1055,5157,Finland,1,2,1,,1,4.083333333333333,,,2,,0,,17.735,1,104.2,1,,,,,,,,0,,0,,,3,2,1
1056,5134,Finland,1,2,1,,2,3.916666666666667,,,2,,0,,15.645,1,105,1,,,,,,,,0,,0,,,3,1,0
1057,5385,Finland,1,2,1,,2,4.916666666666667,,,2,,0,,17.495,1,114.7,1,,,,,,,,0,,0,,,3,1,1
1058,5719,Finland,1,2,1,,2,4.583333333333333,,,2,,0,,15.355,1,105.5,1,,,,,,,,5,Religious/ethical diet,0,,,3,1,0
1059,5325,Finland,1,2,1,,1,4,,,2,,0,,18.66,1,106.3,1,,,,,,,,0,,0,,,3,2,0
1060,5129,Finland,1,2,1,,2,4.666666666666667,,,2,,0,,15.325,1,103.5,1,,,,,,,,0,,0,,,3,2,0
1061,5908,Finland,1,2,1,,1,5.666666666666667,,,2,,,,22.645,1,119.3,1,,,,,,,,0,,0,,,3,2,1
1062,5818,Finland,1,2,1,,1,4,,,2,,0,,19.695,1,113.6,1,,,,,,,,0,,0,,,3,2,0
1063,5566,Finland,1,2,1,,2,6.416666666666667,,,2,,,,25.05,1,120.3,1,,,,,,,,0,,0,,,3,2,0
1065,5183,Finland,1,2,1,,1,3.916666666666667,,,2,,0,,16.135,1,101,1,,,,,,,,0,,0,,,3,2,0
1066,5306,Finland,1,2,1,,1,3.5,,,2,,0,,16.335,1,98,1,,,,,,,,0,,0,,,2,2,0
1067,5046,Finland,2,1,1,,1,3.916666666666667,,,2,,0,,16.51,1,105.4,1,,,,,,,,0,,0,,,3,2,0
1068,5313,Finland,1,2,1,,2,4.75,,,1,,0,,19.605,1,110.2,1,,,,,,,,0,,0,,,3,2,0
1069,5279,Finland,1,2,1,,2,5.5,,,2,,,,20.925,1,116.3,1,,,,,,,,0,,0,,,3,2,0
1070,5341,Finland,2,1,1,,2,5.666666666666667,,,1,,,,28.035,1,118.9,1,,,,,,,,0,,0,,,3,4,0
1071,5781,Finland,1,2,1,,1,4.5,,,2,,0,,21.76,1,112.5,1,,,,,,,,0,,0,,,3,2,0
1072,5594,Finland,1,2,1,,1,4,,,2,,0,,17.69,1,105,1,,,,,,,,0,,0,,,3,2,0
1073,5952,Finland,2,1,1,,1,6.75,,,2,,,,24.81,1,119.4,1,,,,,,,,0,,0,,,2,2,0
1076,5515,Finland,1,2,1,,2,5.083333333333333,,,2,,,,18.2,1,110.8,1,,,,,,,,0,,0,,,3,2,0
1077,5683,Finland,1,2,1,,2,5.25,,,2,,,,16.7,1,110.4,1,,,,,,,,0,,0,,,2,1,0
1079,5162,Finland,1,2,1,,2,4.5,,,2,,0,,13.85,1,96.59999999999999,1,,,,,,,,0,,0,,,2,2,0
1080,5820,Finland,1,2,1,,1,5.333333333333333,,,2,,,,20.035,1,112.2,1,,,,,,,,0,,0,,,3,2,0
1081,5192,Finland,2,1,1,,2,4.333333333333333,,,1,,0,,15.625,1,104.4,1,,,,,,,,0,,7,,,3,2,0
1082,5956,Finland,1,2,1,,1,4.333333333333333,,,2,,0,,17.91,1,108.4,1,,,,,,,,5,Religious/ethical diet,0,,,2,2,0
1083,5388,Finland,2,1,1,,2,5.75,,,2,,,,26.76,1,124.4,1,,,,,,,,0,,7,,,3,3,0
1084,5461,Finland,1,2,1,,1,3.25,,,2,,0,,18.215,1,102.7,1,,,,,,,,0,,0,,,3,2,0
1085,5376,Finland,1,2,1,,2,4.833333333333333,,,2,,0,,20.625,1,110,1,,,,,,,,0,,0,,,3,2,0
1086,5702,Finland,2,1,1,,2,4.416666666666667,,,1,,0,,16.425,1,102.6,1,,,,,,,,0,,0,,,3,2,0
1087,5293,Finland,2,1,1,,2,4.25,,,2,,0,,16.945,1,108.1,1,,,,,,,,0,,0,,,3,2,0
1089,5372,Finland,1,2,1,,2,4.75,,,2,,0,,,,,,,,,,,,,0,,0,,,3,,0
1090,5772,Finland,1,2,1,,1,5.666666666666667,,,1,,,,31.485,1,125.7,1,,,,,,,,0,,0,,,2,4,0
1091,5250,Finland,2,1,1,,2,3.5,,,2,,0,,17.74,1,106.8,1,,,,,,,,0,,0,,,3,2,0
1092,5877,Finland,1,2,1,,1,3,,,1,,0,,17.335,1,98.7,1,,,,,,,,0,,0,,,3,2,0
1093,5780,Finland,1,2,1,,1,4.416666666666667,,,1,,0,,22.66,1,113,1,,,,,,,,0,,0,,,3,3,0
1094,5892,Finland,1,2,1,,2,4.416666666666667,,,2,,0,,16.105,1,106.4,1,,,,,,,,0,,0,,,3,2,0
1095,5362,Finland,1,2,1,,1,4.5,,,2,,0,,,,,,,,,,,,,0,,0,,,2,,0
1096,5666,Finland,1,2,1,,2,4.75,,,1,,0,,19.6,1,111.3,1,,,,,,,,0,,0,,,3,2,0
1097,5703,Finland,2,1,1,,2,3.833333333333333,,,2,,0,,15.01,1,100.4,1,,,,,,,,0,,0,,,3,2,0
1098,5639,Finland,1,2,1,,2,5.583333333333333,,,2,,,,16.945,1,110.1,1,,,,,,,,0,,0,,,2,2,0
1099,5349,Finland,2,1,1,,2,3.833333333333333,,,1,,0,,14.91,1,100.5,1,,,,,,,,0,,0,,,2,2,0
1100,5292,Finland,1,2,1,,2,3.916666666666667,,,2,,0,,15.435,1,98.7,1,,,,,,,,0,,0,,,3,2,0
1101,5230,Finland,1,2,1,,1,5.416666666666667,,,2,,,,21.285,1,118.1,1,,,,,,,,0,,7,,,2,2,0
1102,5626,Finland,1,2,1,,1,3.833333333333333,,,2,,0,,15.94,1,104.4,1,,,,,,,,0,,0,,,3,2,0
1103,5400,Finland,2,1,1,,2,4.5,,,1,,0,,17.395,1,115.4,1,,,,,,,,0,,7,,,3,1,0
1104,5082,Finland,1,2,1,,2,4.333333333333333,,,2,,0,,,,,,,,,,,,,0,,0,,,3,,0
1106,5760,Finland,1,2,1,,2,5.416666666666667,,,2,,,,,,,,,,,,,,,,,0,,,2,,
1108,5964,Finland,1,2,1,,1,3.916666666666667,,,2,,0,,18.885,1,109.1,1,,,,,,,,0,,0,,,2,2,0
1109,5196,Finland,1,2,1,,1,4.833333333333333,,,2,,0,,19.785,1,115.1,1,,,,,,,,0,,0,,,3,2,0
1110,5610,Finland,1,2,1,,2,5.083333333333333,,,2,,,,21.6,1,113.1,1,,,,,,,,0,,0,,,3,2,0
1111,5129,Finland,1,2,1,,1,3.25,,,2,,0,,16.06,1,97.7,1,,,,,,,,0,,0,,,3,2,0
1112,5034,Finland,1,2,1,,2,4.25,,,2,,0,,16.585,1,100.8,1,,,,,,,,0,,0,,,3,2,0
1113,5127,Finland,1,2,1,,1,4.916666666666667,,,2,,0,,20.01,1,112.2,1,,,,,,,,0,,0,,,3,2,0
1114,5694,Finland,1,2,1,,1,6.666666666666667,,,2,,,,21.66,1,120.8,1,,,,,,,,0,,0,,,3,2,0
1115,5445,Finland,1,2,1,,2,6.583333333333333,,,2,,,,36.55,1,133.7,1,,,,,,,,0,,0,,,3,4,0
1116,5660,Finland,1,2,1,,1,4.25,,,2,,0,,19.685,1,110.5,1,,,,,,,,0,,0,,,3,2,0
1117,5834,Finland,2,1,1,,2,5.666666666666667,,,2,,,,21.05,1,118.2,1,,,,,,,,0,,0,,,2,2,0
1120,5446,Finland,1,2,1,,1,5.166666666666667,,,2,,,,18.61,1,108.4,1,,,,,,,,0,,7,,,2,2,0
1121,5078,Finland,1,2,1,,1,5.166666666666667,,,2,,,,23.235,1,117.8,1,,,,,,,,0,,0,,,3,2,0
1122,5081,Finland,1,2,1,,2,5.083333333333333,,,2,,,,17.885,1,106.4,1,,,,,,,,0,,0,,,2,2,0
1123,5532,Finland,1,2,1,,1,5.583333333333333,,,2,,,,25.465,1,123,1,,,,,,,,0,,7,,,3,2,0
1124,5533,Finland,1,2,1,,2,4.416666666666667,,,2,,0,,18.2,1,106,1,,,,,,,,0,,7,,,3,2,1
1125,5982,Finland,1,2,1,,1,4.5,,,2,,0,,22.135,1,118.5,1,,,,,,,,0,,0,,,3,2,0
1126,5015,Finland,2,1,1,,2,5.666666666666667,,,1,,,,22.325,1,115.9,1,,,,,,,,0,,0,,,2,2,0
1127,5186,Finland,1,2,1,,1,5.25,,,1,,,,24.66,1,119,1,,,,,,,,0,,0,,,3,3,0
1130,5367,Finland,1,2,1,,2,3.75,,,2,,0,,13.985,1,97.5,1,,,,,,,,0,,0,,,3,2,0
1131,5944,Finland,1,2,1,,1,4,,,2,,0,,24.385,1,109.1,1,,,,,,,,0,,0,,,,4,0
1132,5947,Finland,1,2,1,,1,5.25,,,2,,,,17.1,1,106.7,1,,,,,,,,0,,0,,,3,2,0
1133,5526,Finland,2,1,1,,2,3.416666666666667,,,2,,0,,16.46,1,100.6,1,,,,,,,,0,,0,,,2,2,0
1134,5265,Finland,2,1,1,,2,4.583333333333333,,,1,,0,,19,1,115.1,1,,,,,,,,0,,0,,,3,2,0
1135,5470,Finland,1,2,1,,1,3.916666666666667,,,2,,0,,19.81,1,106.7,1,,,,,,,,0,,0,,,3,2,0
1137,5308,Finland,1,2,1,,1,5.5,,,2,,,,20.24,1,114.1,1,,,,,,,,0,,0,,,2,2,0
1138,5830,Finland,1,2,1,,2,3.75,,,2,,0,,17.935,1,102.4,1,,,,,,,,0,,0,,,3,2,0
1139,5636,Finland,1,2,1,,2,4.583333333333333,,,2,,0,,20.62,1,107.2,1,,,,,,,,0,,0,,,3,3,0
1140,5773,Finland,1,2,1,,1,4.166666666666667,,,2,,0,,18.81,1,107.7,1,,,,,,,,0,,0,,,3,2,0
1143,5939,Finland,2,1,1,,2,5.416666666666667,,,2,,,,23.6,1,115.2,1,,,,,,,,0,,0,,,3,3,0
1144,5237,Finland,1,2,1,,1,3.583333333333333,,,2,,0,,16.635,1,104.4,1,,,,,,,,0,,0,,,3,2,0
1145,5547,Finland,1,2,1,,1,3.25,,,2,,0,,,,,,,,,,,,,0,,0,,,3,,1
1146,5340,Finland,1,2,1,,2,4.083333333333333,,,2,,0,,,,,,,,,,,,,0,,0,,,3,,0
1147,5803,Finland,2,1,1,,1,4.333333333333333,,,2,,0,,22.21,1,111,1,,,,,,,,0,,0,,,3,3,0
1148,5540,Finland,1,2,1,,2,6.25,,,2,,,,26.95,1,128.2,1,,,,,,,,0,,0,,,3,2,0
1149,5427,Finland,1,2,1,,2,3.916666666666667,,,2,,0,,13.55,1,96.40000000000001,1,,,,,,,,0,,0,,,3,2,0
1150,5871,Finland,1,2,1,,2,5.166666666666667,,,2,,,,20.86,1,113.2,1,,,,,,,,0,,0,,,3,2,0
1151,5662,Finland,1,2,1,,1,2.916666666666667,,,2,,0,,16.535,1,96.5,1,,,,,,,,0,,0,,,3,2,0
1153,5523,Finland,1,2,1,,2,6.333333333333333,,,2,,,,22,1,119.3,1,,,,,,,,0,,0,,,3,2,0
1154,5645,Finland,1,2,1,,1,4.583333333333333,,,2,,0,,20.24,1,114.5,1,,,,,,,,0,,0,,,3,2,0
1155,5629,Finland,2,1,1,,2,3.5,,,2,,0,,19,1,104.4,1,,,,,,,,0,,0,,,3,2,1
1157,5529,Finland,2,1,1,,2,5.5,,,1,,,,14.595,1,104.9,1,,,,,,,,0,,0,,,2,1,0
1158,5588,Finland,1,2,1,,2,3.083333333333333,,,2,,0,,16.2,1,99.3,1,,,,,,,,0,,0,,,3,2,0
1160,5905,Finland,1,2,1,,2,4.333333333333333,,,2,,0,,15.025,1,100.4,1,,,,,,,,0,,0,,,3,2,1
1161,5012,Finland,1,2,1,,2,6,,,2,,,,26.26,1,124.3,1,,,,,,,,0,,0,,,3,2,0
1162,5777,Finland,1,2,1,,2,4.166666666666667,,,2,,0,,16.34,1,104,1,,,,,,,,6,,0,,,3,2,0
1163,5549,Finland,1,2,1,,2,6,,,2,,,,20.625,1,111.2,1,,,,,,,,0,,0,,,3,2,0
1164,5391,Finland,1,2,1,,1,3.916666666666667,,,2,,0,,14.485,1,96.8,1,,,,,,,,0,,0,,,3,2,0
1165,5849,Finland,1,2,1,,1,4.833333333333333,,,2,,0,,18.895,1,110.5,1,,,,,,,,0,,0,,,3,2,0
1169,5799,Finland,1,2,1,,1,4.583333333333333,,,2,,0,,,,,,,,,,,,,0,,0,,,3,,0
1170,5510,Finland,1,2,1,,2,4.583333333333333,,,2,,0,,16.6,1,107.8,1,,,,,,,,0,,0,,,2,2,0
1171,5328,Finland,1,2,1,,2,3.083333333333333,,,2,,0,,15.66,1,96.09999999999999,1,,,,,,,,0,,0,,,3,2,0
1172,5299,Finland,1,2,1,,1,6.416666666666667,,,2,,,,22.585,1,121.9,1,,,,,,,,0,,0,,,2,2,0
1173,5419,Finland,1,2,1,,2,3.25,,,2,,0,,15.825,1,97,1,,,,,,,,0,,7,,,3,2,0
1174,5476,Finland,1,2,1,,1,4.5,,,1,,0,,17.685,1,106.8,1,,,,,,,,0,,0,,,3,2,0
1175,5146,Finland,2,1,1,,1,4,,,2,,0,,,,,,,,,,,,,0,,0,,,3,,0
1176,5899,Finland,1,2,1,,1,3.833333333333333,,,2,,0,,18.215,1,105.6,1,,,,,,,,0,,0,,,3,2,0
1177,5749,Finland,2,1,1,,2,4.083333333333333,,,1,,0,,17.39,1,99.8,1,,,,,,,,0,,6,Other clinical diet,,2,3,0
1178,5708,Finland,1,2,1,,2,3.833333333333333,,,1,,0,,13.95,1,93,1,,,,,,,,0,,0,,,3,2,0
1179,5252,Finland,2,1,1,,1,3.833333333333333,,,1,,0,,17.01,1,102.4,1,,,,,,,,0,,0,,,3,2,0
1181,5214,Finland,1,2,1,,2,4.083333333333333,,,2,,0,,17.95,1,102.8,1,,,,,,,,0,,0,,,3,2,0
1182,5382,Finland,1,2,1,,2,5.666666666666667,,,2,,,,24.935,1,119.6,1,,,,,,,,0,,0,,,3,3,0
1184,5169,Finland,1,2,1,,1,4.666666666666667,,,2,,0,,17.19,1,109.1,1,,,,,,,,0,,0,,,3,2,0
1186,5035,Finland,1,2,1,,1,3.75,,,2,,0,,15.095,1,104,1,,,,,,,,0,,0,,,3,1,0
1187,5941,Finland,2,1,1,,2,5.083333333333333,,,2,,,,20.775,1,112.8,1,,,,,,,,0,,0,,,3,2,0
1188,5916,Finland,2,1,1,,1,7.083333333333333,,,2,,,,30.585,1,133.4,1,,,,,,,,0,,0,,,3,2,0
1189,5137,Finland,1,2,1,,1,5.166666666666667,,,2,,,,20.585,1,113,1,,,,,,,,0,,0,,,3,2,0
1191,5107,Finland,1,2,1,,1,4.25,,,2,,0,,,,,,,,,,,,,0,,0,,,2,,0
1193,5606,Finland,1,2,1,,2,5.166666666666667,,,2,,,,20.425,1,116.3,1,,,,,,,,0,,0,,,2,2,0
1194,5132,Finland,1,2,1,,1,4.5,,,1,,0,,19.135,1,109,1,,,,,,,,0,,0,,,3,2,0
1195,5481,Finland,1,2,1,,2,5.75,,,2,,,,18.1,1,113.8,1,,,,,,,,0,,0,,,3,2,0
1196,5102,Finland,1,2,1,,1,3.333333333333333,,,2,,0,,15.735,1,103.9,1,,,,,,,,0,,0,,,3,1,0
1198,5224,Finland,1,2,1,,1,4.583333333333333,,,2,,0,,17.84,1,106.5,1,,,,,,,,0,,0,,,2,2,0
1199,5267,Finland,2,1,1,,2,4.916666666666667,,,2,,0,,19.3,1,114.9,1,,,,,,,,0,,7,,,3,2,0
1200,5647,Finland,2,1,1,,2,4.083333333333333,,,2,,0,,23.835,1,119.6,1,,,,,,,,0,,0,,,3,2,0
1201,5193,Finland,1,2,1,,2,6.583333333333333,,,2,,,,24.55,1,125.2,1,,,,,,,,0,,0,,,3,2,0
1202,5118,Finland,1,2,1,,2,5.083333333333333,,,2,,,,22.45,1,118.5,1,,,,,,,,0,,0,,,3,2,0
1203,5915,Finland,1,2,1,,1,4.416666666666667,,,2,,0,,18.54,1,106,1,,,,,,,,0,,0,,,2,2,1
1205,5870,Finland,1,2,1,,2,5.5,,,2,,,,19.075,1,114.2,1,,,,,,,,0,,0,,,2,2,0
1206,5094,Finland,1,2,1,,1,5.333333333333333,,,2,,,,,,,,,,,,,,,0,,0,,,3,,0
1207,5086,Finland,1,2,1,,1,5.416666666666667,,,2,,,,22.24,1,119.1,1,,,,,,,,0,,7,,,3,2,0
1208,5729,Finland,1,2,1,,2,4.166666666666667,,,2,,0,,18.275,1,108,1,,,,,,,,0,,0,,,3,2,0
1209,5651,Finland,1,2,1,,1,6.666666666666667,,,1,,,,21.94,1,120.3,1,,,,,,,,0,,0,,,3,2,0
1210,5747,Finland,1,2,1,,1,6.5,,,2,,,,24.435,1,126.3,1,,,,,,,,0,,0,,,3,2,0
1211,5681,Finland,2,1,1,,1,5.75,,,2,,,,23.59,1,125.3,1,,,,,,,,0,,0,,,3,2,0
1213,5180,Finland,1,2,1,,2,5,,,2,,0,,18.17,1,111.3,1,,,,,,,,0,,0,,,3,2,0
1214,5473,Finland,1,2,1,,2,5.333333333333333,,,2,,,,18.555,1,103.4,1,,,,,,,,0,,0,,,3,3,1
1216,5737,Finland,2,1,1,,1,4.083333333333333,,,2,,0,,18.47,1,104,1,,,,,,,,0,,0,,,3,2,0
1217,5572,Finland,2,1,1,,1,4.666666666666667,,,1,,0,,18.535,1,106.6,1,,,,,,,,0,,0,,,2,2,0
1218,5321,Finland,1,2,1,,2,3.25,,,2,,0,,15.25,1,96.40000000000001,1,,,,,,,,0,,0,,,2,2,1
1219,5154,Finland,2,1,1,,2,5.333333333333333,,,1,,,,18.285,1,112,1,,,,,,,,0,,0,,,3,2,0
1220,5269,Finland,1,2,1,,2,4.25,,,1,,0,,17.65,1,99.8,1,,,,,,,,0,,0,,,3,3,0
1222,5917,Finland,1,2,1,,2,4.666666666666667,,,2,,0,,16.075,1,107.5,1,,,,,,,,0,,0,,,3,1,0
1223,5432,Finland,1,2,1,,1,3.333333333333333,,,2,,0,,17.385,1,102.4,1,,,,,,,,5,Religious/ethical diet,0,,,3,2,0
1224,5344,Finland,1,2,1,,1,5.166666666666667,,,1,,,,23.76,1,115.2,1,,,,,,,,0,,0,,,2,3,0
1225,5245,Finland,2,1,1,,1,5,,,1,,0,,18.785,1,110.7,1,,,,,,,,0,,0,,,3,2,0
1226,5428,Finland,1,2,1,,1,6.166666666666667,,,2,,,,19.195,1,114.2,1,,,,,,,,0,,0,,,3,2,1
1227,5631,Finland,2,1,1,,1,3.916666666666667,,,2,,0,,20.32,1,105.9,1,,,,,,,,0,,7,,,3,3,0
1229,5952,Finland,2,1,1,,2,4.416666666666667,,,2,,0,,17.925,1,105.1,1,,,,,,,,0,,0,,,2,2,0
1230,5392,Finland,1,2,1,,2,5.583333333333333,,,1,,,,22.18,1,122.5,1,,,,,,,,0,,0,,,3,2,0
1231,5935,Finland,1,2,1,,2,4.666666666666667,,,2,,0,,16.8,1,106.9,1,,,,,,,,0,,0,,,3,2,0
1232,5641,Finland,1,2,1,,2,3.666666666666667,,,2,,0,,17.41,1,106,1,,,,,,,,0,,0,,,3,2,0
1233,5038,Finland,1,2,1,,2,3.416666666666667,,,2,,0,,18.135,1,103.6,1,,,,,,,,0,,0,,,3,2,0
1234,5649,Finland,1,2,1,,1,5.833333333333333,,,1,,,,17.175,1,111.1,1,,,,,,,,0,,0,,,2,1,0
1236,5808,Finland,1,2,1,,1,6.333333333333333,,,2,,,,20.44,1,118.7,1,,,,,,,,0,,0,,,2,2,0
1238,5359,Finland,1,2,1,,2,5.333333333333333,,,2,,,,20.54,1,116.6,1,,,,,,,,0,,0,,,3,2,0
1239,5084,Finland,1,2,1,,1,4.583333333333333,,,2,,0,,,,107.5,1,,,,,,,,0,,0,,,3,2,0
1241,5750,Finland,1,2,1,,1,4.166666666666667,,,2,,0,,22.485,1,115.4,1,,,,,,,,0,,0,,,3,2,0
1242,5037,Finland,1,2,1,,1,5.333333333333333,,,2,,,,18.635,1,108.5,1,,,,,,,,0,,0,,,2,2,0
1243,5493,Finland,1,2,1,,2,5.416666666666667,,,2,,,,17.85,1,108.8,1,,,,,,,,,,0,,,3,2,
1244,5468,Finland,2,1,1,,1,5.5,,,2,,,,22.84,1,117.9,1,,,,,,,,0,,0,,,3,2,0
1246,5705,Finland,1,2,1,,1,3.583333333333333,,,1,,0,,17.935,1,102.9,1,,,,,,,,0,,0,,,2,2,1
1247,5693,Finland,2,1,1,,1,5.916666666666667,,,2,,,,23.81,1,126,1,,,,,,,,0,,0,,,3,2,0
1248,5541,Finland,2,1,1,,2,5.083333333333333,,,1,,,,23.36,1,121.2,1,,,,,,,,0,,0,,,3,2,0
1249,5360,Finland,1,2,1,,2,5.166666666666667,,,2,,,,17.01,1,105.5,1,,,,,,,,0,,0,,,3,2,0
1250,5471,Finland,1,2,1,,1,4,,,2,,0,,17.735,1,110.9,1,,,,,,,,0,,0,,,2,1,0
1251,5296,Finland,1,2,1,,2,5.083333333333333,,,2,,,,19.795,1,106.8,1,,,,,,,,0,,0,,,2,3,0
1252,5614,Finland,1,2,1,,2,4.916666666666667,,,2,,0,,15.75,1,108.4,1,,,,,,,,0,,0,,,3,1,0
1253,5122,Finland,1,2,1,,2,4.416666666666667,,,2,,0,,18.36,1,106,1,,,,,,,,0,,0,,,3,2,0
1254,5124,Finland,1,2,1,,2,3.916666666666667,,,2,,0,,18.3,1,105.7,1,,,,,,,,0,,0,,,3,2,0
1255,5783,Finland,1,2,1,,2,4.083333333333333,,,2,,0,,17.975,1,108.5,1,,,,,,,,0,,0,,,3,2,0
1257,5837,Finland,1,2,1,,2,5.5,,,1,,,,21.025,1,114.5,1,,,,,,,,0,,0,,,2,2,0
1258,5873,Finland,1,2,1,,2,5.166666666666667,,,2,,,,19.4,1,110.5,1,,,,,,,,0,,0,,,2,2,0
1259,5912,Finland,1,2,1,,2,4,,,2,,0,,20.15,1,106.4,1,,,,,,,,0,,0,,,3,3,0
1260,5314,Finland,1,2,1,,1,4.333333333333333,,,2,,0,,18.185,1,107.8,1,,,,,,,,0,,0,,,2,2,0
1261,5211,Finland,2,1,1,,1,3.916666666666667,,,1,,0,,15.66,1,104.2,1,,,,,,,,0,,0,,,3,1,0
1263,5579,Finland,1,2,1,,1,4.75,,,2,,0,,15.735,1,101.5,1,,,,,,,,0,,0,,,3,2,0
1264,5779,Finland,1,2,1,,2,3.583333333333333,,,2,,0,,17.06,1,103.5,1,,,,,,,,0,,0,,,3,2,0
1266,5611,Finland,1,2,1,,2,3.416666666666667,,,2,,0,,13.05,1,92.90000000000001,1,,,,,,,,0,,0,,,3,2,0
1267,5254,Finland,1,2,1,,2,4.833333333333333,,,2,,0,,16.845,1,109.6,1,,,,,,,,0,,0,,,3,1,0
1268,5842,Finland,1,2,1,,2,5,,,2,,0,,18.555,1,113,1,,,,,,,,0,,0,,,3,2,0
1269,5583,Finland,2,1,1,,1,5.5,,,1,,,,24.745,1,117.1,1,,,,,,,,0,,7,,,3,3,0
1271,5854,Finland,1,2,1,,2,5.666666666666667,,,2,,,,,,,,,,,,,,,0,,0,,,3,,0
1273,5282,Finland,1,2,1,,2,4.583333333333333,,,2,,0,,,,,,,,,,,,,0,,0,,,2,,0
1274,5491,Finland,1,2,1,,1,4.166666666666667,,,2,,0,,16.785,1,103.5,1,,,,,,,,0,,5,,,2,2,1
1275,5120,Finland,1,2,1,,1,5.5,,,2,,,,21.16,1,115.7,1,,,,,,,,0,,0,,,3,2,0
1276,5489,Finland,2,1,1,,2,5.5,,,1,,,,21.125,1,112.8,1,,,,,,,,0,,0,,,3,2,0
1278,5425,Finland,1,2,1,,1,4.666666666666667,,,2,,0,,19.385,1,112.1,1,,,,,,,,0,,0,,,3,2,0
1279,5080,Finland,1,2,1,,2,5.166666666666667,,,2,,,,17.85,1,113.3,1,,,,,,,,0,,0,,,3,1,1
1280,5675,Finland,1,2,1,,1,4.75,,,1,,0,,18.085,1,107.7,1,,,,,,,,0,,0,,,3,2,0
1281,5954,Finland,1,2,1,,2,5,,,2,,0,,20.185,1,107.9,1,,,,,,,,0,,0,,,2,3,0
1282,5446,Finland,1,2,1,,1,3.75,,,2,,0,,16.26,1,101.1,1,,,,,,,,0,,7,,,2,2,0
1283,5797,Finland,1,2,1,,1,4,,,2,,0,,15.61,1,101.7,1,,,,,,,,0,,0,,,3,2,0
1284,5108,Finland,1,2,1,,1,5.583333333333333,,,2,,,,21.77,1,121.9,1,,,,,,,,0,,0,,,2,2,0
1285,5643,Finland,2,1,1,,2,3.166666666666667,,,2,,0,,15.725,1,99.40000000000001,1,,,,,,,,0,,0,,,3,2,0
1286,5440,Finland,1,2,1,,1,3.333333333333333,,,2,,0,,,,,,,,,,,,,0,,0,,,3,,0
1287,5770,Finland,1,2,1,,2,5.416666666666667,,,2,,,,18.4,1,109.9,1,,,,,,,,0,,0,,,3,2,0
1288,5620,Finland,1,2,1,,1,5.333333333333333,,,1,,,,22.93,1,120.3,1,,,,,,,,0,,0,,,3,2,0
1289,5167,Finland,1,2,1,,2,5.416666666666667,,,2,,,,25.585,1,112.6,1,,,,,,,,0,,0,,,3,4,0
1290,5251,Finland,1,2,1,,2,3.5,,,2,,0,,14.4,1,99.5,1,,,,,,,,0,,0,,,3,2,0
1291,5223,Finland,2,1,1,,2,3.333333333333333,,,2,,0,,16.025,1,99.5,1,,,,,,,,0,,0,,,2,2,0
1292,5695,Finland,1,2,1,,1,3.916666666666667,,,2,,0,,13.99,1,98,1,,,,,,,,0,,0,,,3,2,0
1293,5684,Finland,1,2,1,,1,4.5,,,2,,0,,18.685,1,113.2,1,,,,,,,,0,,0,,,3,2,0
1295,5427,Finland,1,2,1,,1,5.75,,,2,,,,18.585,1,113.4,1,,,,,,,,0,,0,,,3,2,0
1296,5591,Finland,1,2,1,,2,2.75,,,2,,0,,19.685,1,103.9,1,,,,,,,,0,,0,,,3,3,0
1299,5855,Finland,1,2,1,,2,6.666666666666667,,,2,,,,29.05,1,123,1,,,,,,,,0,,0,,,3,3,0
1300,5029,Finland,1,2,1,,2,5.25,,,2,,,,15.625,1,105.7,1,,,,,,,,0,,0,,,2,2,0
1301,5733,Finland,1,2,1,,1,5.083333333333333,,,2,,,,,,,,,,,,,,,0,,7,,,3,,0
1302,5587,Finland,2,1,1,,1,5.916666666666667,,,1,,,,26.66,1,122.2,1,,,,,,,,0,,0,,,3,3,0
1303,5828,Finland,1,2,1,,2,5.333333333333333,,,2,,,,20.235,1,114.1,1,,,,,,,,0,,0,,,3,2,0
1304,5664,Finland,1,2,1,,2,4.5,,,2,,0,,17.7,1,105.3,1,,,,,,,,0,,0,,,2,2,0
1305,5933,Finland,2,1,1,,2,5.166666666666667,,,2,,,,17.8,1,109.4,1,,,,,,,,0,,0,,,3,2,0
1306,5297,Finland,1,2,1,,2,3.583333333333333,,,1,,0,,17.25,1,101.1,1,,,,,,,,0,,6,Other clinical diet,,3,2,0
1307,5602,Finland,1,2,1,,1,5.416666666666667,,,2,,,,19.685,1,117.8,1,,,,,,,,0,,0,,,3,2,0
1308,5743,Finland,1,2,1,,1,4.166666666666667,,,2,,0,,18.235,1,105.7,1,,,,,,,,0,,7,,,3,2,1
1309,5256,Finland,1,2,1,,2,5.333333333333333,,,2,,,,20.685,1,114.1,1,,,,,,,,0,,0,,,3,2,0
1310,5368,Finland,1,2,1,,1,4.416666666666667,,,2,,0,,17.685,1,109.4,1,,,,,,,,0,,0,,,3,2,0
1311,5054,Finland,1,2,1,,2,2.833333333333333,,,2,,0,,15.2,1,98.09999999999999,1,,,,,,,,0,,0,,,2,2,0
1312,5588,Finland,1,2,1,,1,4.083333333333333,,,2,,0,,17.135,1,104.4,1,,,,,,,,0,,0,,,3,2,0
1315,5170,Finland,1,2,1,,1,3,,,2,,0,,,,,,,,,,,,,0,,0,,,2,,0
1316,5065,Finland,2,1,1,,1,6.333333333333333,,,2,,,,29.935,1,125.6,1,,,,,,,,0,,0,,,3,3,0
1317,5790,Finland,1,2,1,,2,5.5,,,2,,,,,,,,,,,,,,,0,,7,,,2,,0
1318,5977,Finland,1,2,1,,2,4.666666666666667,,,2,,0,,21.35,1,113,1,,,,,,,,0,,0,,,2,2,0
1319,5836,Finland,1,2,1,,2,3.833333333333333,,,1,,0,,18.245,1,107,1,,,,,,,,0,,0,,,3,2,0
1320,5278,Finland,2,1,1,,1,4.666666666666667,,,2,,0,,21.91,1,108,1,,,,,,,,0,,7,,,3,3,0
1321,5861,Finland,1,2,1,,1,6.583333333333333,,,2,,,,25.24,1,124.5,1,,,,,,,,0,,0,,,3,2,0
1323,5444,Finland,1,2,1,,2,5.25,,,1,,,,19.075,1,111,1,,,,,,,,0,,0,,,3,2,0
1324,5831,Finland,1,2,1,,1,3.416666666666667,,,2,,0,,18.065,1,104.1,1,,,,,,,,0,,0,,,3,2,0
1325,5210,Finland,1,2,1,,2,4.5,,,2,,0,,16.525,1,105.8,1,,,,,,,,0,,0,,,3,2,0
1326,5139,Finland,1,2,1,,2,5.166666666666667,,,2,,,,21.205,1,109.6,1,,,,,,,,0,,0,,,2,3,0
1327,5893,Finland,1,2,1,,1,5.666666666666667,,,2,,,,18.835,1,116.3,1,,,,,,,,0,,0,,,3,1,0
1328,5866,Finland,1,2,1,,2,3.833333333333333,,,2,,0,,16.625,1,102.4,1,,,,,,,,0,,0,,,3,2,0
1329,5948,Finland,1,2,1,,2,3.166666666666667,,,2,,0,,15.65,1,93.5,1,,,,,,,,0,,0,,,3,3,0
1330,5519,Finland,1,2,1,,1,3.833333333333333,,,2,,0,,14.835,1,101.1,1,,,,,,,,0,,0,,,3,1,1
1331,5951,Finland,1,2,1,,1,4,,,1,,0,,,,,,,,,,,,,0,,0,,,3,,0
1332,5894,Finland,1,2,1,,1,3,,,2,,0,,14.895,1,97,1,,,,,,,,0,,0,,,2,2,0
1333,5457,Finland,1,2,1,,1,5.333333333333333,,,2,,,,23.64,1,121.8,1,,,,,,,,0,,0,,,3,2,0
1334,5599,Finland,2,1,1,,1,4.75,,,2,,0,,16.925,1,108.5,1,,,,,,,,0,,0,,,3,2,0
1335,5972,Finland,1,2,1,,2,4.083333333333333,,,2,,0,,24.3,1,105.4,1,,,,,,,,0,,0,,,2,4,0
1336,5021,Finland,1,2,1,,1,3.333333333333333,,,2,,0,,,,,,,,,,,,,0,,0,,,2,,0
1338,5291,Finland,1,2,1,,2,4.666666666666667,,,2,,0,,13.92,1,95.59999999999999,1,,,,,,,,0,,0,,,2,2,0
1339,5126,Finland,2,1,1,,1,6.583333333333333,,,2,,,,23.31,1,119.2,1,,,,,,,,0,,0,,,3,2,0
1340,5673,Finland,1,2,1,,1,4.416666666666667,,,2,,0,,20.345,1,107.2,1,,,,,,,,0,,0,,,3,3,0
1341,5300,Finland,2,1,1,,2,4.583333333333333,,,2,,0,,15.65,1,103.3,1,,,,,,,,0,,0,,,3,2,0
1342,5275,Finland,2,1,1,,2,5.583333333333333,,,2,,,,23.8,1,117.9,1,,,,,,,,5,Religious/ethical diet,0,,,3,2,0