id,hh_id,country,sec_area,tert_area,round,smpl_weight,sex,age,edc_level,edc,residence,preg_lact,breastfeeding,hh_head,wgt,wgt_method,hgt,hgt_method,bmi_adults,bmi_children,bmi_cat,misrep,pa,pa_cat,smok,special_diet,special_diet_other,clin_diet,clin_diet_other,note,smpl_weight_24hr1,smpl_weight_24hr2,edc_level_adults,edc_level_children,race,country_birth,marital_status,hh_size,fam_size,hh_income,fam_income,recum_length,recum_length_method,bmi_chld,psu,stratum
73557,,United States of America,,,1,13481.042095,1,69,,,,,0,,78.3,1,171.3,1,26.700001,,3,,,,2,0,,0,,,16888.327864,12930.890649,3,,4,1,4,3,3,4,4,,,,1,112
73558,,United States of America,,,1,24471.769625,1,54,,,,,0,,89.5,1,176.8,1,28.6,,3,,40,1,1,0,,0,,,17932.143865,12684.148869,3,,3,1,1,4,4,7,7,,,,1,108
73559,,United States of America,,,2,57193.285376,1,72,,,,,0,,88.90000000000001,1,175.3,1,28.9,,3,,1560,2,2,,,3,,,59641.81293,39394.236709,4,,3,1,1,2,2,10,10,,,,1,109
73560,,United States of America,,,1,55766.512438,1,9,,,,,0,,32.2,1,137.3,1,,,,,,,,0,,0,,,142203.069917,125966.366442,,3,3,1,,4,4,9,9,,,17.1,2,109
73561,,United States of America,,,1,65541.871229,2,73,,,,,0,,52,1,162.4,1,19.700001,,2,,240,1,,5,,,,,59052.357033,39004.892993,5,,3,1,1,2,2,12,12,,,,2,116
73562,,United States of America,,,1,25344.992359,1,56,,,,,0,,105,1,158.7,1,41.700001,,4,,9600,3,2,0,,0,,,49890.828664,0,4,,1,1,3,1,1,9,9,,,,1,111
73563,,United States of America,,,2,17913.555067,1,.4166666666666667,,,,,3,,7.4,1,,,,,,,,,,0,,0,,,31417.217097,40735.782424,,,3,1,,3,3,12,12,68,1,,1,105
73564,,United States of America,,,2,61758.65488,2,61,,,,,0,,93.40000000000001,1,161.8,1,35.700001,,4,,,,,0,,0,,,78988.755072,52173.157754,5,,3,1,2,1,1,10,10,,,,1,114
73566,,United States of America,,,1,17480.115175,2,56,,,,,0,,61.8,1,152.8,1,26.5,,3,,28800,3,1,0,,0,,,30697.88078,0,3,,3,1,3,7,7,4,4,,,,1,112
73567,,United States of America,,,2,34795.429301,1,65,,,,,0,,65.3,1,172.4,1,22,,2,,720,2,1,0,,0,,,44503.03602,0,2,,3,1,2,1,1,3,3,,,,2,112
73568,,United States of America,,,2,91523.51604800001,2,26,,,,0,0,,47.1,1,152.5,1,20.299999,,2,,480,1,,0,,0,,,56404.073021,43955.549706,5,,3,1,5,3,3,12,12,,,,2,113
73570,,United States of America,,,1,12071.467415,2,9,,,,,0,,31.9,1,135.5,1,,,,,,,,0,,0,,,31176.247118,24410.40789,,2,6,1,,4,4,5,5,,,17.4,2,115
73571,,United States of America,,,1,46190.114005,1,76,,,,,0,,102.4,1,172.5,1,34.400002,,4,,2320,2,,0,,0,,,59076.733601,39020.994051,5,,3,1,1,2,2,11,11,,,,1,116
73572,,United States of America,,,1,12764.396165,2,10,,,,,0,,41.7,1,145.4,1,,,,,,,,0,,0,,,32965.832195,25811.618932,,3,4,1,,3,3,2,2,,,19.700001,2,111
73574,,United States of America,,,1,15397.219846,2,33,,,,0,0,,56.8,1,158,1,22.799999,,2,,1680,2,,0,,0,,,14293.003545,10296.524837,5,,5,2,1,4,4,8,8,,,,2,114
73575,,United States of America,,,1,7721.542396,1,1.5,,,,,0,,9.4,1,,,,,,,,,,0,,0,,,6537.795388,0,,,4,1,,2,2,3,3,80,1,,2,116
73576,,United States of America,,,2,12665.77009,1,16,,,,,0,,67.3,1,170.4,1,,,,,5640,3,3,0,,0,,,5756.102451,0,,9,4,1,,6,6,8,8,,,23.200001,1,104
73577,,United States of America,,,1,39735.01707,1,32,,,,,0,,79.7,1,166.2,1,28.9,,3,,,,2,0,,0,,,42414.513234,0,1,,1,2,6,7,5,5,2,,,,2,118
73578,,United States of America,,,1,11758.631127,1,18,,,,,0,,109.4,1,175.2,1,,,,,15600,3,,0,,0,,,26314.101424,44781.189125,,15,1,1,,7,7,5,5,,,35.599998,2,118
73579,,United States of America,,,2,70708.03403,2,12,,,,,0,,40.2,1,161,1,,,,,1000,2,3,0,,0,,,56916.588362,43139.654705,,6,3,1,,4,4,10,10,,,15.5,1,110
73580,,United States of America,,,1,27196.638394,2,38,,,,0,0,,93.5,1,161.4,1,35.900002,,4,,17280,3,,0,,0,,,46103.178421,0,3,,4,1,1,6,6,14,14,,,,2,116
73581,,United States of America,,,1,16764.260669,1,50,,,,,0,,80.90000000000001,1,185,1,23.6,,2,,1920,2,,0,,0,,,9369.093876999999,27439.88929,5,,5,2,1,3,3,12,12,,,,2,106
73583,,United States of America,,,2,48196.409412,2,7,,,,,0,,19.7,1,116.9,1,,,,,,,,0,,0,,,38522.690763,29514.517908,,1,3,1,,3,3,12,12,,,14.4,1,110
73584,,United States of America,,,2,72182.239545,1,13,,,,,0,,53.1,1,144.9,1,,,,,,,3,0,,0,,,58103.253352,44039.081732,,7,3,1,,3,3,9,9,,,25.299999,1,105
73585,,United States of America,,,2,18590.965473,1,28,,,,,0,,92.2,1,175.1,1,30.1,,4,,3840,3,,3,,,,,41674.371348,0,4,,5,2,1,2,2,7,7,,,,1,110
73586,,United States of America,,,1,13569.677359,2,4,,,,,0,,18.6,1,109.4,1,,,,,,,,0,,0,,,6888.037391,5138.002658,,,5,1,,4,4,6,6,,,15.5,1,116
73587,,United States of America,,,1,15523.094127,1,14,,,,,0,,110.2,1,168.8,1,,,,,880,2,3,0,,0,,,8525.915306999999,6544.872124,,8,5,1,,7,7,12,12,,,38.700001,2,115
73588,,United States of America,,,1,8291.078844,1,11,,,,,0,,31.5,1,141.5,1,,,,,,,,0,,0,,,9615.804064,7657.103402,,4,4,1,,3,3,6,6,,,15.7,1,109
73589,,United States of America,,,2,61374.100237,1,35,,,,,0,,78.3,1,172.9,1,26.200001,,3,,1848,2,,0,,0,,,37969.853687,29589.809773,3,,3,1,3,1,1,5,5,,,,1,114
73590,,United States of America,,,1,12849.217833,1,2,,,,,0,,15.2,1,98.3,1,,,,,,,,0,,0,,,8058.355857,6315.401484,,,1,1,,5,5,5,5,99.5,1,15.7,1,106
73591,,United States of America,,,1,51133.1337,1,6,,,,,0,,21.6,1,112.2,1,,,,,,,,0,,0,,,28680.156752,21973.568909,,0,3,1,,4,4,12,12,,,17.200001,2,114
73592,,United States of America,,,2,68450.77963400001,1,29,,,,,0,,92.90000000000001,1,173.1,1,31,,4,,4560,3,,0,,0,,,140175.054228,216981.997884,4,,1,1,5,3,1,14,6,,,,2,107
73593,,United States of America,,,2,59265.550305,1,3,,,,,0,,19.2,1,106.5,1,,,,,,,,0,,0,,,40362.894994,166815.056042,,,3,1,,4,4,12,12,108.5,1,16.9,2,113
73594,,United States of America,,,2,45736.924249,1,23,,,,,0,,62.7,1,159.4,1,24.700001,,2,,12240,3,,0,,0,,,93661.107603,144981.390332,1,,2,2,5,7,7,5,5,,,,2,112
73595,,United States of America,,,1,25027.722535,1,58,,,,,0,,96,1,175.3,1,31.200001,,4,,4800,3,2,0,,0,,,49266.29289,44280.875346,4,,2,1,1,2,2,8,8,,,,1,111
73596,,United States of America,,,1,16152.838244,2,57,,,,,0,,104,1,164.7,1,38.299999,,4,,160,1,2,0,,0,,,18336.828812,14457.355234,5,,5,2,1,3,3,12,12,,,,2,106
73597,,United States of America,,,1,38185.196521,2,50,,,,,0,,104.4,1,180.5,1,32,,4,,,,,,,4,,,34458.438692,23468.91581,4,,4,2,6,2,1,12,6,,,,1,111
73598,,United States of America,,,1,59637.374349,1,20,,,,,0,,86.7,1,165,1,31.799999,,4,,2880,2,1,0,,0,,,63658.968589,261478.755709,2,,1,1,6,6,6,,,,,,1,106
73599,,United States of America,,,2,27288.181037,2,13,,,,,0,,44.9,1,158.8,1,,,,,800,2,3,0,,0,,,14441.446421,10945.824934,,6,3,1,,7,3,8,6,,,17.799999,2,107
73600,,United States of America,,,2,20786.063147,1,37,,,,,0,,126.2,1,185.1,1,36.799999,,4,,12480,3,1,,,2,,,16546.273241,0,3,,4,1,3,6,6,5,5,,,,1,114
73601,,United States of America,,,1,18842.869403,1,12,,,,,0,,49.4,1,153.8,1,,,,,3240,3,3,0,,0,,,9967.845138000001,7579.92151,,5,1,1,,4,4,11,11,,,20.9,1,115
73603,,United States of America,,,2,18698.337962,1,35,,,,,0,,95.40000000000001,1,165.4,1,34.900002,,4,,,,,0,,0,,,8354.080209,6018.188836,5,,5,2,1,4,4,11,11,,,,2,104
73604,,United States of America,,,1,74721.457945,2,69,,,,,0,,59.5,1,156.9,1,24.200001,,2,,1800,2,1,0,,0,,,81669.787279,62420.176736,4,,3,1,6,2,1,10,6,,,,1,117
73605,,United States of America,,,1,57916.08746,1,13,,,,,0,,55.7,1,162.3,1,,,,,7320,3,3,0,,0,,,46619.682682,146281.564402,,6,3,1,,4,4,12,12,,,21.1,1,116
73606,,United States of America,,,1,39507.031397,1,16,,,,,0,,84.2,1,176.8,1,,,,,12300,3,3,0,,0,,,31801.272292,24103.621551,,10,3,1,,5,5,11,11,,,26.9,1,117
73607,,United States of America,,,1,18688.69332,1,75,,,,,0,,111.9,1,169.6,1,38.900002,,4,,480,1,2,0,,0,,,23902.667928,15788.040505,3,,3,1,1,2,2,4,4,,,,2,116
73608,,United States of America,,,1,6293.309092,1,3,,,,,0,,11.8,1,93.3,1,,,,,,,,0,,0,,,3194.515772,15365.001586,,,5,1,,4,4,3,3,95.8,1,13.6,1,118
73609,,United States of America,,,1,12465.530134,2,11,,,,,0,,41.8,1,153.5,1,,,,,,,,0,,0,,,6814.1366,5531.309686,,6,1,1,,5,5,6,6,,,17.700001,1,116
73610,,United States of America,,,2,75125.75657699999,1,43,,,,,0,,90.2,1,176.8,1,28.9,,3,,1920,2,,0,,0,,,55049.793929,204240.622136,5,,3,1,1,6,6,10,10,,,,2,112
73611,,United States of America,,,2,15381.008532,2,3,,,,,0,,13.1,1,91.5,1,,,,,,,,0,,0,,,9646.162265000001,7559.778764,,,2,1,,7,7,5,5,92,1,15.6,2,112
73612,,United States of America,,,1,9316.851210999999,2,6,,,,,0,,25.3,1,118.1,1,,,,,,,,0,,0,,,5328.374751,0,,0,5,1,,7,7,7,7,,,18.1,1,112
73613,,United States of America,,,2,14308.015798,2,60,,,,,0,,104.9,1,163.8,1,39.099998,,4,,400,1,,0,,0,,,26765.196821,83043.495597,2,,4,1,1,6,6,12,12,,,,1,106
73614,,United States of America,,,2,28605.446685,2,55,,,,,0,,60.9,1,167.9,1,21.6,,2,,,,1,,,2,,,50235.744056,40256.244286,3,,3,2,2,2,2,5,5,,,,1,106
73615,,United States of America,,,2,10872.080055,2,65,,,,,0,,55.4,1,145.9,1,26,,3,,,,1,0,,0,,,15074.843231,12268.157107,1,,2,2,2,1,1,3,3,,,,1,104
73616,,United States of America,,,1,71785.98865299999,2,62,,,,,0,,71.8,1,172.8,1,24,,2,,2520,2,2,0,,0,,,91813.623311,60644.159394,4,,3,1,1,2,2,12,12,,,,2,108
73617,,United States of America,,,2,16058.875803,1,6,,,,,0,,23.2,1,118,1,,,,,,,,0,,0,,,18451.104265,57786.726772,,1,1,2,,6,6,4,4,,,16.700001,1,109
73618,,United States of America,,,2,27752.641769,2,54,,,,,0,,79.40000000000001,1,155.8,1,32.700001,,4,,720,2,,0,,0,,,22146.73263,15665.30225,5,,3,1,1,4,4,13,13,,,,1,104
73619,,United States of America,,,2,48389.973357,2,36,,,,0,0,,81.7,1,173.1,1,27.299999,,3,,14880,3,2,3,,,,,99094.081553,153391.28572,3,,1,2,3,2,2,3,3,,,,1,109
73620,,United States of America,,,2,53416.732289,2,3,,,,,0,,14.4,1,100.5,1,,,,,,,,0,,0,,,47737.394874,37403.292824,,,3,1,,4,4,12,12,100.3,1,14.3,1,104
73621,,United States of America,,,2,37406.341605,1,80,,,,,0,,76.40000000000001,1,176.2,1,24.6,,2,,1080,2,2,0,,0,,,40884.747779,58775.599692,5,,3,1,1,2,2,11,11,,,,1,110
73622,,United States of America,,,1,57124.924258,1,72,,,,,0,,99.5,1,185.4,1,28.9,,3,,3240,3,,0,,0,,,59570.525173,39347.150167,5,,3,1,1,2,2,11,11,,,,1,111
73623,,United States of America,,,2,73392.06555299999,1,32,,,,,0,,91.5,1,186.6,1,26.299999,,3,,480,1,,0,,0,,,45404.918037,173436.534786,4,,3,1,1,4,4,11,11,,,,2,107
73624,,United States of America,,,1,29729.350351,2,31,,,,1,0,,82.90000000000001,1,171.1,1,28.299999,,3,,,,,4,,,,,47182.532939,73882.076044,1,,3,1,6,6,6,4,4,,,,2,109
73626,,United States of America,,,2,15104.349307,2,72,,,,,0,,72.40000000000001,1,164.8,1,26.700001,,3,,,,,0,,0,,,12010.44496,0,3,,4,1,1,4,4,4,4,,,,2,116
73627,,United States of America,,,1,6070.014099,1,0,,,,,3,,6.4,1,,,,,,,,,,0,,0,,,3081.170095,2298.341202,,,5,1,,5,5,12,12,57.9,1,,2,118
73628,,United States of America,,,1,34161.490249,1,80,,,,,0,,74,1,176.9,1,23.6,,2,,1600,2,2,0,,0,,,37338.158522,28537.535503,4,,3,1,2,1,1,7,7,,,,2,104
73630,,United States of America,,,1,15160.22207,1,13,,,,,0,,56.9,1,166.9,1,,,,,3000,3,3,0,,0,,,8326.611199000001,6391.877419,,7,5,1,,4,4,12,12,,,20.4,1,106
73631,,United States of America,,,1,29752.936842,2,56,,,,,0,,98.8,1,158.9,1,39.099998,,4,,1680,2,1,0,,0,,,49697.210504,66544.62166400001,2,,4,1,3,1,1,2,2,,,,1,111
73632,,United States of America,,,1,56888.206263,1,23,,,,,0,,87.5,1,166.1,1,31.700001,,4,,,,,0,,0,,,116496.955045,180329.818258,1,,1,2,1,2,2,7,7,,,,2,109
73633,,United States of America,,,1,69862.668846,2,43,,,,0,0,,76.8,1,158.7,1,30.5,,4,,1440,2,,5,Low carbohydrate diet,,,,42693.996348,30199.23382,5,,3,1,1,4,4,11,11,,,,2,115
73635,,United States of America,,,1,15215.239041,2,4,,,,,0,,21.3,1,106.9,1,,,,,,,,0,,0,,,15925.168859,0,,,1,1,,4,4,12,12,,,18.6,1,116
73636,,United States of America,,,2,12902.633666,2,1.916666666666667,,,,,0,,13.1,1,,,,,,,,,,0,,0,,,30279.958435,35346.998868,,,1,1,,4,4,11,11,93.09999999999999,1,,1,109
73637,,United States of America,,,2,29014.714132,2,2,,,,,0,,11.7,1,83.59999999999999,1,,,,,,,,0,,0,,,29531.567132,23138.628656,,,3,1,,5,5,2,2,85.7,1,16.700001,2,107
73638,,United States of America,,,1,38961.542319,2,63,,,,,0,,60.9,1,156.6,1,24.799999,,2,,1920,2,1,,,3,,,35103.833083,23186.563955,4,,6,1,2,1,1,6,6,,,,1,115
73639,,United States of America,,,1,42642.037692,1,71,,,,,0,,81.5,1,164,1,30.299999,,4,,,,2,0,,0,,,46607.309911,35621.943179,2,,3,1,1,5,5,7,7,,,,1,116
73640,,United States of America,,,2,16596.936217,2,67,,,,,0,,54.9,1,157.6,1,22.1,,2,,4080,3,,,,1,,,20791.753219,15919.627416,4,,4,1,3,1,1,6,6,,,,2,116
73641,,United States of America,,,1,102099.513184,2,64,,,,,0,,48.1,1,157.7,1,19.299999,,2,,200,1,1,0,,0,,,106470.541524,70325.255209,4,,3,1,3,1,1,2,2,,,,2,109
73642,,United States of America,,,1,34652.391419,2,57,,,,,0,,95.5,1,159,1,37.799999,,4,,240,1,1,0,,0,,,27652.763803,19559.946393,3,,3,1,1,3,3,8,8,,,,2,115
73643,,United States of America,,,1,15654.365466,1,62,,,,,0,,73.59999999999999,1,168.9,1,25.799999,,3,,4800,3,2,0,,0,,,22995.647328,32342.748618,4,,5,2,1,2,2,1,1,,,,1,117
73644,,United States of America,,,2,8836.63083,1,8,,,,,0,,19.9,1,117.5,1,,,,,,,,0,,0,,,5053.733234,3777.134734,,2,6,1,,6,6,7,7,,,14.4,2,113
73645,,United States of America,,,1,57900.271904,2,54,,,,,0,,75.40000000000001,1,160.7,1,29.200001,,3,,2120,2,2,3,,,,,46204.67672,171424.291454,4,,3,1,1,6,6,12,12,,,,2,106
73647,,United States of America,,,2,13008.28149,2,61,,,,,0,,74.2,1,163.8,1,27.700001,,3,,,,1,0,,0,,,16425.440034,11241.855349,3,,2,1,1,3,3,10,10,,,,1,109
73648,,United States of America,,,2,10885.883987,2,16,,,,,0,,48.3,1,151.4,1,,,,,800,2,3,0,,0,,,7291.897668,5730.966155,,11,4,1,,4,4,12,12,,,21.1,2,104
73650,,United States of America,,,1,11997.409698,1,6,,,,,0,,24.8,1,118.4,1,,,,,,,,0,,0,,,7180.081191,5366.356474,,0,6,1,,6,6,10,10,,,17.700001,2,106
73651,,United States of America,,,2,7280.506713,2,6,,,,,0,,45.7,1,127.9,1,,,,,,,,0,,0,,,18802.923342,14722.330965,,0,4,1,,4,4,9,9,,,27.9,2,105
73652,,United States of America,,,1,20705.307503,2,54,,,,,0,,107.5,1,171.8,1,36.400002,,4,,840,2,1,,,2,,,18684.533123,84770.451271,3,,4,1,1,2,2,9,9,,,,2,114
73653,,United States of America,,,1,9644.938244000001,2,10,,,,,0,,36.3,1,147.1,1,,,,,,,,0,,0,,,24909.397325,19503.583824,,4,4,1,,6,6,3,3,,,16.799999,2,114
73654,,United States of America,,,2,21039.644636,1,46,,,,,0,,113.7,1,177.2,1,36.200001,,4,,,,,0,,0,,,36948.984388,29608.94418,1,,3,1,5,3,3,4,4,,,,1,106
73655,,United States of America,,,1,17125.17752,1,44,,,,,0,,113.1,1,190.54,1,31.200001,,4,,3120,3,,0,,0,,,15453.812824,10525.265969,3,,4,1,1,5,5,8,8,,,,2,106
73656,,United States of America,,,1,78471.254533,1,54,,,,,0,,88.8,1,178,1,28,,3,,120,1,,0,,0,,,57501.269713,40673.032219,5,,3,1,1,4,4,12,12,,,,1,116
73658,,United States of America,,,1,15648.040484,1,35,,,,,0,,71.90000000000001,1,172.2,1,24.200001,,2,,1840,2,,0,,0,,,6991.262303,30739.36779,5,,5,1,1,3,3,12,12,,,,1,117
73659,,United States of America,,,1,48670.994201,2,70,,,,,0,,117.2,1,159.5,1,46.099998,,4,,,,,3,,,,,53196.89755,40658.361648,4,,3,1,2,2,2,6,6,,,,1,117
73660,,United States of America,,,2,17997.997114,1,59,,,,,0,,73.90000000000001,1,172.8,1,24.700001,,2,,840,2,2,0,,0,,,10058.595955,29459.279953,5,,5,2,1,3,3,7,7,,,,2,104
73661,,United States of America,,,1,24784.598492,1,25,,,,,0,,63.4,1,173.8,1,21,,2,,3000,3,,0,,0,,,20751.657451,15424.691187,4,,4,2,5,3,3,7,7,,,,2,114
73663,,United States of America,,,2,68946.240895,1,25,,,,,0,,124.8,1,194.6,1,33,,4,,6120,3,,0,,0,,,42490.159621,33112.472614,5,,3,1,5,2,1,12,9,,,,2,117
73664,,United States of America,,,1,16326.737883,2,5,,,,,0,,20.9,1,111.1,1,,,,,,,,0,,0,,,10239.274138,8024.605544,,,1,1,,4,4,11,11,,,16.9,2,109
73665,,United States of America,,,2,18210.210305,1,59,,,,,0,,92,1,161.8,1,35.099998,,4,,240,1,,,,1,,,35846.232242,32218.834591,1,,1,2,4,2,2,1,1,,,,2,117
73666,,United States of America,,,1,16106.697971,1,70,,,,,0,,77.3,1,171.4,1,26.299999,,3,,1200,2,2,3,,3,,,16840.022145,13305.996612,5,,5,1,1,2,2,9,9,,,,2,106
73667,,United States of America,,,2,32349.363631,1,24,,,,,0,,88.2,1,174.2,1,29.1,,3,,,,1,0,,0,,,34144.28912,26608.557099,4,,3,1,6,5,5,4,4,,,,2,107
73668,,United States of America,,,2,30352.349685,2,30,,,,0,0,,83.09999999999999,1,160.3,1,32.299999,,4,,1200,2,,0,,0,,,18777.86024,14633.538412,4,,3,1,5,7,7,8,8,,,,2,115
73669,,United States of America,,,2,16913.018873,1,4,,,,,0,,21.6,1,107.8,1,,,,,,,,0,,0,,,33267.065428,32637.925739,,,4,1,,4,4,5,5,,,18.6,1,106
73670,,United States of America,,,2,15877.769625,2,71,,,,,0,,70.7,1,142.6,1,34.799999,,4,,,,,0,,0,,,11061.163225,7570.451489,1,,1,2,2,1,1,3,3,,,,1,109
73671,,United States of America,,,1,27110.497857,1,49,,,,,0,,58.2,1,165.3,1,21.299999,,2,,,,,0,,0,,,25571.05573,17415.906724,2,,4,1,5,1,1,3,3,,,,2,114
73672,,United States of America,,,2,59465.072125,1,73,,,,,0,,83.90000000000001,1,176.3,1,27,,3,,180,1,2,0,,0,,,62010.858167,40959.023631,4,,3,1,1,2,2,11,11,,,,1,109
73673,,United States of America,,,1,125551.020684,1,45,,,,,0,,65.3,1,184.1,1,19.299999,,2,,,,,0,,0,,,100190.277728,70868.737584,5,,3,1,1,4,4,12,12,,,,2,111
73674,,United States of America,,,2,48214.248422,2,45,,,,,0,,58.4,1,164.9,1,21.5,,2,,5400,3,,,,5,,,35329.886326,24990.293467,5,,3,2,1,5,5,14,14,,,,2,105
73675,,United States of America,,,1,18733.93248,1,29,,,,,0,,72.7,1,169.5,1,25.299999,,3,,,,,0,,0,,,41994.852829,65955.92157400001,3,,5,2,1,3,3,4,4,,,,1,118
73676,,United States of America,,,2,106739.035267,1,44,,,,,0,,109.6,1,170.8,1,37.599998,,4,,3600,3,1,0,,0,,,65229.629173,46139.621303,4,,3,1,1,4,4,10,10,,,,2,113
73677,,United States of America,,,2,13207.281267,2,61,,,,,0,,105.2,1,169.9,1,36.400002,,4,,,,,3,,,,,16545.374954,26606.950186,4,,4,1,1,2,2,12,12,,,,1,104
73678,,United States of America,,,2,22191.083063,1,51,,,,,0,,100.1,1,172.3,1,33.700001,,4,,1200,2,2,0,,0,,,38971.094608,56821.699305,2,,3,1,1,5,5,6,6,,,,1,109
73679,,United States of America,,,1,13157.235349,2,1.916666666666667,,,,,0,,13.2,1,,,,,,,,,,0,,0,,,8251.528297000001,6466.792355,,,1,1,,5,5,7,7,86.09999999999999,1,,1,106
73680,,United States of America,,,2,64069.672991,1,12,,,,,0,,46.9,1,161.3,1,,,,,720,2,3,0,,0,,,134011.429251,239401.037381,,7,3,1,,3,3,8,8,,,18,1,110
73681,,United States of America,,,2,10508.68508,2,9,,,,,0,,38.1,1,142.4,1,,,,,,,,0,,0,,,12187.733176,9705.140885999999,,3,4,1,,5,5,6,6,,,18.799999,2,108
73683,,United States of America,,,2,15628.491997,2,2,,,,,3,,14.2,1,90.8,1,,,,,,,,5,,,,,30740.465064,49434.137749,,,6,1,,4,4,8,8,92.90000000000001,1,17.200001,2,107
73684,,United States of America,,,2,22985.770887,1,64,,,,,0,,63.9,1,160.5,1,24.799999,,2,,100,1,,0,,0,,,33765.193616,47489.820728,5,,5,2,1,2,2,12,12,,,,2,113
73685,,United States of America,,,2,8930.155715000001,2,.0833333333333333,,,,,0,,3.8,1,,,,,,,,,,0,,0,,,17565.171344,17232.982548,,,6,1,,4,3,6,5,50.9,1,,1,114
73686,,United States of America,,,2,20774.857101,2,7,,,,,0,,34.3,1,125.3,1,,,,,,,,3,,,,,12824.413803,10410.094257,,1,1,1,,6,6,5,5,,,21.799999,2,107
73687,,United States of America,,,1,18467.47473,1,8,,,,,0,,28.7,1,136.6,1,,,,,,,,0,,0,,,10358.255631,7936.073915,,1,3,1,,4,4,4,4,,,15.4,1,113
73688,,United States of America,,,1,112268.202205,1,58,,,,,0,,97.09999999999999,1,170.1,1,33.599998,,4,,2400,2,2,0,,0,,,68608.575855,48529.69039,3,,3,1,1,2,2,10,10,,,,2,109
73690,,United States of America,,,2,63967.668022,2,77,,,,,0,,56.3,1,162.2,1,21.4,,2,,1320,2,,0,,0,,,69916.00517200001,53436.76707,4,,3,1,1,2,2,8,8,,,,1,114
73691,,United States of America,,,2,89715.949242,1,14,,,,,0,,52.8,1,167.1,1,,,,,10200,3,3,0,,0,,,47479.459051,35986.827882,,7,3,1,,6,6,8,8,,,18.9,2,109
73692,,United States of America,,,1,19134.135451,1,65,,,,,0,,57.8,1,156,1,23.799999,,2,,240,1,,,,3,,,19840.133996,13578.930977,3,,2,2,1,2,2,6,6,,,,1,111
73693,,United States of America,,,2,21566.209667,2,78,,,,,0,,78.8,1,149.6,1,35.200001,,4,,1440,2,2,0,,0,,,23571.646009,18015.797014,2,,3,1,3,1,1,2,2,,,,1,105
73694,,United States of America,,,2,77265.06976499999,2,66,,,,,0,,76,1,168.4,1,26.799999,,3,,,,,0,,0,,,80572.89953900001,53219.506935,3,,3,1,1,2,2,10,10,,,,1,109
73696,,United States of America,,,1,48793.566775,2,8,,,,,0,,27.9,1,123.6,1,,,,,,,,0,,0,,,27367.912786,0,,1,3,1,,3,3,,,,,18.299999,2,116
73697,,United States of America,,,2,85893.30222300001,2,57,,,,,0,,57.9,1,160.5,1,22.5,,2,,3600,3,,0,,0,,,62939.913056,44520.010156,5,,3,1,1,2,2,8,8,,,,2,104
73698,,United States of America,,,1,75025.20432400001,1,23,,,,,0,,92.3,1,178.2,1,29.1,,3,,11020,3,1,0,,0,,,46236.500583,36031.986535,4,,3,1,6,2,1,9,6,,,,2,114
73700,,United States of America,,,2,8459.358344,1,.8333333333333334,,,,,0,,11.5,1,,,,,,,,,,0,,0,,,5305.266106,4157.781815,,,1,1,,4,4,3,3,78.3,1,,1,110
73701,,United States of America,,,2,16694.715057,1,47,,,,,0,,70.09999999999999,1,168.9,1,24.6,,2,,800,2,2,0,,0,,,10399.09407,8198.985693000001,5,,5,2,1,4,4,12,12,,,,2,104
73702,,United States of America,,,2,81166.214601,2,48,,,,,0,,123.3,1,163.3,1,46.200001,,4,,1200,2,1,,,2,,,59476.051774,42069.87745,2,,3,1,1,2,2,9,9,,,,2,113
73703,,United States of America,,,1,35886.262082,2,38,,,,0,0,,63.7,1,156.2,1,26.1,,3,,720,2,,0,,0,,,20699.212268,15393.039631,2,,2,2,1,4,4,,,,,,1,108
73705,,United States of America,,,1,40035.566775,1,10,,,,,0,,35.9,1,147.3,1,,,,,,,,0,,0,,,22455.62217,17204.583832,,4,3,1,,4,4,12,12,,,16.5,2,114
73706,,United States of America,,,2,26393.198829,1,54,,,,,0,,91.90000000000001,1,172.7,1,30.799999,,4,,20040,3,1,,,3,,,16129.231148,11408.87395,4,,3,1,1,4,4,6,6,,,,1,106
73707,,United States of America,,,2,29082.043437,1,45,,,,,0,,100,1,176.3,1,32.200001,,4,,1800,2,,0,,0,,,26243.725373,17874.04783,3,,4,1,5,2,1,,1,,,,2,105
73708,,United States of America,,,2,18746.991814,1,69,,,,,0,,71.2,1,165.8,1,25.9,,3,,,,2,0,,0,,,25993.91848,21154.281398,5,,1,1,1,4,3,12,12,,,,1,106
73711,,United States of America,,,2,18257.715353,1,5,,,,,0,,18.9,1,111.3,1,,,,,,,,0,,0,,,19109.604469,14976.358274,,,1,1,,7,7,4,4,,,15.3,1,106
73712,,United States of America,,,1,8729.687016,1,18,,,,,0,,85.09999999999999,1,176.7,1,,,,,160,1,,0,,0,,,7969.072139,6117.41452,,15,5,1,,4,4,12,12,,,27.299999,2,118
73713,,United States of America,,,1,15206.737881,1,3,,,,,0,,15.2,1,,,,,,,,,,0,,0,,,15916.271042,12473.715921,,,1,1,,5,4,,4,,,,1,111
73714,,United States of America,,,1,96550.719254,2,29,,,,0,0,,71.90000000000001,1,164.9,1,26.4,,3,,4320,3,,0,,0,,,153232.661922,239943.607843,5,,3,1,1,3,3,12,12,,,,2,114
73715,,United States of America,,,2,114048.376574,2,38,,,,0,0,,85.2,1,157,1,34.599998,,4,,1920,2,,0,,0,,,120376.424951,93809.039791,4,,3,1,1,3,3,9,9,,,,1,105
73716,,United States of America,,,2,95151.756211,1,25,,,,,0,,86.3,1,181.2,1,26.299999,,3,,6160,3,,0,,0,,,151012.410922,134447.776026,5,,3,1,5,1,1,8,8,,,,1,105
73717,,United States of America,,,2,20230.569183,1,78,,,,,0,,85.7,1,162.5,1,32.5,,4,,1440,2,,0,,0,,,25343.774082,19404.974484,3,,4,1,2,3,3,7,7,,,,2,108
73718,,United States of America,,,1,21529.556816,1,53,,,,,0,,99.8,1,194,1,26.5,,3,,,,1,0,,0,,,19428.338236,13232.231398,4,,4,1,1,3,3,5,5,,,,1,116
73719,,United States of America,,,2,12238.500766,2,11,,,,,0,,57.7,1,151.3,1,,,,,,,,0,,0,,,35856.9271,35375.116241,,6,1,1,,7,7,6,6,,,25.200001,1,107
73720,,United States of America,,,2,38220.880648,1,48,,,,,0,,129.7,1,178.1,1,40.900002,,4,,5760,3,,0,,0,,,34490.640158,23490.847549,3,,4,1,1,3,3,9,9,,,,2,112
73722,,United States of America,,,1,22037.897003,2,80,,,,,0,,63.4,1,160.6,1,24.6,,2,,5040,3,,0,,0,,,27607.897624,44396.815356,4,,4,1,2,1,1,7,7,,,,2,118
73723,,United States of America,,,2,66046.132365,1,77,,,,,0,,105.1,1,177.3,1,33.400002,,4,,,,,,,2,,,59506.689631,0,4,,3,1,1,2,2,12,12,,,,2,112
73724,,United States of America,,,1,24215.070799,1,26,,,,,0,,65.09999999999999,1,184.2,1,19.200001,,2,,10380,3,,0,,0,,,19275.856864,14327.729733,4,,4,1,5,2,2,,,,,,2,106
73725,,United States of America,,,2,77051.185852,2,80,,,,,0,,56.4,1,149.9,1,25.1,,3,,,,,0,,0,,,84216.15599100001,64366.365043,4,,3,1,2,2,2,8,8,,,,2,104
73726,,United States of America,,,2,14157.712152,2,67,,,,,0,,52.3,1,149,1,23.6,,2,,2160,2,,0,,0,,,19630.58496,31846.799892,3,,1,1,3,7,7,8,8,,,,1,106
73728,,United States of America,,,2,58071.991591,1,16,,,,,0,,66.90000000000001,1,177.6,1,,,,,120,1,3,0,,0,,,121466.369801,97745.04923,,9,3,1,,6,6,12,12,,,21.200001,2,112