id,sex,age,recall_n,recall_d,recall_m,recall_y,weekday,respondent,us_intake,consum_h,consum_min,meal_type,meal_place,eat_seq,food_type,rcp_code,rcp_descr,rcp_descr_eng,foodex2_rcp_code,foodex2_rcp_descr,rcp_amount,ingr_code,ingr_descr,ingr_descr_eng,foodex2_ingr_code,foodex2_ingr_descr,ingr_amount_unproc,ingr_amount_proc,energy,totalpro,animalpro,dairypro,plantpro,carb,adsugar,fiber,totalfat,sfa,mufa,pufa,water,n6,seafood_n3,plant_n3,tfa,chol,ca,fe,na,k,mg,zn,iod,se,ph,cu,vitb1,vitb2,vitb3,vitb6,fol,vitb12,vitc,vita,bcarot,vitd,vite,vitk,note
1-01-01-0-10-002,2,32,1,21,7,2016,4,1,0,9,30,2,2,1,1,,,,,,,110200003,"Açúcar, branco",White sugar,A032J,White sugar,6,,23.832,0,,,,5.958,,0,0,0,0,0,.03,,,,0,,.12,0,0,.12,0,0,,,0,,0,0,0,0,0,0,0,0,0,0,0,,
1-01-01-0-10-002,2,32,1,21,7,2016,4,1,0,9,30,2,2,1,1,,,,,,,999900337,Meia de leite,Milk with coffee,A03KG,Coffee with milk or cream,222,,56.499,4.107,,,,5.772,,0,1.887,.999,.444,.1554,205.683,,,,.0555,,127.65,.111,47.73,476.19,21.09,.5550000000000001,,,102.12,,.0444,.1998,.999,.0555,1.11,.1332,0,24.42,13.32,.0555,.0333,,
1-01-01-0-10-002,2,32,1,21,7,2016,4,1,0,9,30,2,2,2,4,,,,,,,120100022,Croissant,Croissant,A00BM,Croissant,102,,424.218,7.752,,,,43.044,,2.652,23.97,10.608,7.14,2.55,23.154,,,,1.785,,45.9,1.836,448.8,122.4,30.6,.816,,,117.3,,.1428,.102,2.04,.0816,74.45999999999999,.0102,0,21.42,0,.1326,.0612,,
1-01-01-0-10-002,2,32,1,21,7,2016,4,1,0,9,30,2,2,3,6,,,,,,,200201101,"Ácido fólico e vitamina B12, pastilha, comprimido, drageia ou cápsula","Folic acid and vitamin B12, tabs or capsules",A03SL#F04.A0EXQ$F04.A0EXP$F03.A06JH,"Vitamin only supplements, INGRED= Vitamin B9   (folic acid, folinic acid), INGRED= Vitamin B12 (cyanocobalamin, hydroxocobalamin, methylcobalamin), STATE= Tablets",.83,,0,0,,,,0,,0,0,0,0,0,0,,,,0,,0,28.0000000008,0,0,0,9.9999999991,,,0,,1.10000000015,1.40000000004,15.9999999969,1.40000000004,399.999999964,2.50000000019,39.9999999964,0,0,5.00000000038,0,,
1-01-01-0-10-002,2,32,1,21,7,2016,4,1,0,13,0,4,2,1,1,,,,,,,60301011,"Pão, chapata","Wheat bread, roll",A004Y,"Wheat bread and rolls, white (refined flour)",72.75,,199.1895,5.9655,,,,37.1025,,1.67325,2.619,.589275,1.171275,.53835,26.69925,,,,0,,33.10125,2.204325,216.795,86.57250000000001,17.46,.45105,,,68.38500000000001,,.341925,.24735,1.81875,.04365,21.0975,.021825,0,0,0,0,.1455,,
1-01-01-0-10-002,2,32,1,21,7,2016,4,1,0,13,0,4,2,1,1,,,,,,,70204037,"Leitão, carne","Piglet, meat",A01RG#F31.A0C8R,"Pig fresh meat, ANIMAGE= Suckler",98,,128.478,21.756,,,,0,,0,4.606,1.568,1.568,.784,70.56,,,,.0196,,6.86,.588,51.94,388.08,22.54,1.568,,,216.58,,.6860000000000001,.1568,5.194,.4312,4.9,.98,0,24.5,0,.588,.49,,
1-01-01-0-10-002,2,32,1,21,7,2016,4,1,0,13,0,4,2,2,1,,,,,,,130300027,"Refrigerante, tipo Seven-up","Soft drink, like Seven-Up",A03FX#F04.A06QH$F04.A06QE$F28.A07JN,"Diet soft drinks with flavours, INGRED= Lime flavour, INGRED= Lemon flavour, PROCESS= Carbonating",208,,76.544,.208,,,,18.928,,0,0,0,0,0,189.28,,,,0,,4.16,.208,8.112,2.08,.832,.208,,,4.16,,0,0,0,0,0,0,0,0,0,0,0,,
1-01-01-0-10-002,2,32,1,21,7,2016,4,1,0,13,0,4,2,4,3,RCP_606,Batatas fritas - Rodelas,French fries,A0BYS,Potato crisps from potato slices,100,10200002,"Batata, crua",Potatoes,A00ZT,Potatoes,154.066667,,138.6600003,3.851666675,,,,29.580800064,,2.465066672,0,0,0,0,117.09066692,,,,0,,13.86600003,.308133334,13.86600003,696.38133484,20.02866671,.308133334,,,64.70800014,,.275009000595,.02927266673,2.0490866711,.64399866806,43.13866676,0,20.490866711,0,0,0,.0924400002,,
1-01-01-0-10-002,2,32,1,21,7,2016,4,1,0,13,0,4,2,4,3,RCP_606,Batatas fritas - Rodelas,French fries,A0BYS,Potato crisps from potato slices,100,100100003,"Óleo, alimentar",Vegetable oil,A036N,"Vegetable fats and oils, edible",11.933333,,106.862997015,0,,,,0,,0,11.873666335,1.348466629,2.458266598,7.625399787,0,,,,.0286399992,,0,0,0,0,0,0,,,0,,0,0,0,0,0,0,0,0,0,0,7.27933313,,
1-01-01-0-10-002,2,32,1,21,7,2016,4,1,0,13,0,4,2,4,3,RCP_606,Batatas fritas - Rodelas,French fries,A0BYS,Potato crisps from potato slices,100,150500006,"Sal, n.e.",Salt,A042P,Salt,.666667,,0,0,,,,0,,0,0,0,0,0,0,,,,0,,0,0,266.6668,0,2.000001,0,,,0,,0,0,0,0,0,0,0,0,0,0,0,,
1-01-01-0-10-002,2,32,1,21,7,2016,4,1,0,13,0,4,2,3,6,,,,,,,200202301,"Magnésio, vitamina C e vitaminas do complexo B, pastilha, comprimido, drageia, cápsula","Magnesium, vitamin C and complex B vitamins, tabs or capsules",A03SN#F04.A0EXY$F04.A0EXX$F04.A0EXV$F04.A0EXT$F04.A0EXS$F04.A0EXR$F04.A0EXQ$F04.A0EXP$F04.A0EXN$F04.A0EXF$F03.A06JH,"Combination of vitamin and mineral only supplements, INGRED= Vitamin B1   (thiamine), INGRED= Vitamin B2   (riboflavin), INGRED= Vitamin B3   (niacin, niacinamide), INGRED= Vitamin B5   (pantothenic acid), INGRED= Vitamin B6   (pyridoxine, pyridoxamine, pyridoxal), INGRED= Vitamin B7   (biotin), INGRED= Vitamin B9   (folic acid, folinic acid), INGRED= Vitamin B12 (cyanocobalamin, hydroxocobalamin, methylcobalamin), INGRED= Vitamin C     (ascorbic acid), INGRED= Magnesium, STATE= Tablets",.71,,0,0,,,,0,,0,0,0,0,0,0,,,,0,,0,0,0,0,200.187969912,0,,,0,,.153477443585,.180169172935,2.00187969912,6.67293233111,22.0206766889,.286936090193,20.0187969912,0,0,0,0,,
1-01-01-0-10-002,2,32,1,21,7,2016,4,1,0,16,0,5,1,1,1,,,,,,,50600013,"Iogurte, cremoso meio gordo açucarado","Yoghurt, cow milk, semi-skimmed, spoonable, with added sugar",A02NF#F03.A0CEE$F08.A032H$F10.A077G,"Yoghurt, cow milk, STATE= Spoonable creamy, SWEET= Sucrose (common sugar), QUAL= Semi-skimmed",125,,114.3125,5.875,,,,16.375,,0,2.625,1.5,.625,.125,98.625,,,,.1,,202.5,.25,101.25,286.25,17.5,.75,,,170,,.05,.3375,.25,.05,10,0,0,56.25,32.5,0,.05,,
1-01-01-0-10-002,2,32,1,21,7,2016,4,1,0,20,0,6,1,1,1,,,,,,,80200094,"Marmota, n.e.",Hakes,A02CB,Hakes,112.5,,78.41249999999999,19.35,,,,0,,0,.1125,0,0,.1125,91.91249999999999,,,,0,,28.125,.225,136.125,293.625,28.125,.7875,,,203.625,,.045,.0225,.75375,.07875,7.65,.54,0,10.125,0,.45,.14625,,
1-01-01-0-10-002,2,32,1,21,7,2016,4,1,0,20,0,6,1,3,1,,,,,,,40200061,Manga,Mangoes,A01LF,Mangoes,72,,42.552,.36,,,,8.424,,2.088,.216,.072,.072,.072,60.12,,,,0,,6.48,.144,10.08,82.8,9.359999999999999,.072,,,7.2,,.0288,.036,.36,.0936,25.92,0,16.56,216,1296,0,.72,,
1-01-01-0-10-002,2,32,1,21,7,2016,4,1,0,20,0,6,1,2,1,,,,,,,130500013,"Água filtrada, rede pública de abastecimento","Filtered water, public water supply",A03DN,Filtered tap water,471.056,,0,0,,,,0,,0,0,0,0,0,471.056,,,,0,,56.52672,0,9.42112,4.71056,9.42112,.235528,,,0,,0,0,0,0,0,0,0,0,0,0,0,,
1-01-01-0-10-002,2,32,1,21,7,2016,4,1,0,20,0,6,1,5,3,RCP_63,Arroz de ervilhas,Rice with peas ,A041G,Rice and vegetables meal,99,150500006,"Sal, n.e.",Salt,A042P,Salt,.1485,,0,0,,,,0,,0,0,0,0,0,0,,,,0,,0,0,59.4,0,.4455,0,,,0,,0,0,0,0,0,0,0,0,0,0,0,,
1-01-01-0-10-002,2,32,1,21,7,2016,4,1,0,20,0,6,1,5,3,RCP_63,Arroz de ervilhas,Rice with peas ,A041G,Rice and vegetables meal,99,100100003,"Óleo, alimentar",Vegetable oil,A036N,"Vegetable fats and oils, edible",.627,,5.614785,0,,,,0,,0,.623865,.070851,.129162,.400653,0,,,,.0015048,,0,0,0,0,0,0,,,0,,0,0,0,0,0,0,0,0,0,0,.38247,,
1-01-01-0-10-002,2,32,1,21,7,2016,4,1,0,20,0,6,1,5,3,RCP_63,Arroz de ervilhas,Rice with peas ,A041G,Rice and vegetables meal,99,60200042,"Arroz, comum cru",Rice grain,A001D,Rice grain,30.184,,104.73848,2.022328,,,,23.573704,,.633864,.120736,.030184,.030184,.030184,4.195576,,,,0,,3.92392,.181104,1.81104,28.37296,9.65888,.392392,,,26.26008,,.0135828,.0090552,.573496,.07002688,4.587968,0,0,0,0,0,.030184,,
1-01-01-0-10-002,2,32,1,21,7,2016,4,1,0,20,0,6,1,5,3,RCP_63,Arroz de ervilhas,Rice with peas ,A041G,Rice and vegetables meal,99,150500028,"Cubo de carne, galinha para caldo","Stock cubes for broth, chicken",A043G,"Stock cubes or granulate, chicken",.099,,.233838,.015246,,,,.00891,,0,.015246,.003564,.005049,.003168,.005742,,,,.0000594,,.1188,.00099,16.137,.396,.04653,.001188,,,.198,,.0000792,.0001584,.004257,.000198,.00594,.000495,0,.0099,0,.000396,.000099,,
1-01-01-0-10-002,2,32,1,21,7,2016,4,1,0,20,0,6,1,5,3,RCP_63,Arroz de ervilhas,Rice with peas ,A041G,Rice and vegetables meal,99,150400006,Folha de louro,"Bay leaves, dry",A016Z,"Bay leaves, dry",.0495,,.151569,.003762,,,,.024057,,.0014355,.004158,.0011385,.000792,.0011385,.002673,,,,0,,.41085,.021285,.011385,.26235,.0594,.0018315,,,.05445,,4.95000000000e-06,.0002079,.00099,.0000891,0,0,0,.3069,1.8414,0,.0003465,,
1-01-01-0-10-002,2,32,1,21,7,2016,4,1,0,20,0,6,1,5,3,RCP_63,Arroz de ervilhas,Rice with peas ,A041G,Rice and vegetables meal,99,30100013,"Ervilhas, grão, congeladas cruas","Frozen garden peas, raw",A012J#F28.A07KQ,"Garden peas (without pods), PROCESS= Freezing",15.0865,,10.0536436,.759605275,,,,1.056055,,1.056055,.0754325,.0150865,.0150865,.030173,11.978681,,,,0,,4.82768,.1659515,1.659515,27.970371,2.564705,.1357785,,,14.48304,,.04344912,.002866435,.25797915,.01357785,6.125119,0,1.689688,10.107955,54.3114,0,.0271557,,
1-01-01-0-10-002,2,32,1,21,7,2016,4,1,0,20,0,6,1,5,3,RCP_63,Arroz de ervilhas,Rice with peas ,A041G,Rice and vegetables meal,99,20800001,"Cebola, crua","Onions, raw",A00HC,Onions,7.546,,1.539384,.067914,,,,.233926,,.098098,.015092,0,0,.015092,7.078148,,,,0,,2.33926,.03773,.7546000000000001,15.8466,.90552,.022638,,,2.2638,,.00882882,.00071687,.0430122,.0135828,.8979740000000001,0,.513128,0,0,0,.022638,,
1-01-01-0-10-002,2,32,1,21,7,2016,4,1,0,20,0,6,1,5,3,RCP_63,Arroz de ervilhas,Rice with peas ,A041G,Rice and vegetables meal,99,100100009,"Azeite, n.e.",Olive oil,A036P,Olive oils,1.2595,,11.3292025,.0012595,,,,0,,0,1.2582405,.181368,.989967,.0869055,0,,,,0,,0,0,0,0,0,0,,,0,,0,0,0,0,0,0,0,0,0,0,.17633,,
1-01-01-0-10-002,2,32,1,21,7,2016,4,1,0,20,0,6,1,4,6,,,,,,,200202503,"Ferro, pastilha, comprimido, drageia ou cápsula","Iron, tabs or capsules",A03SM#F04.A0EXD$F03.A06JH,"Mineral only supplements, INGRED= Iron, STATE= Tablets",.83,,0,0,,,,0,,0,0,0,0,0,0,,,,0,,0,94.857142869,0,0,0,0,,,0,,0,0,0,0,0,0,22.134025,0,0,0,0,,
1-01-01-0-10-002,2,32,1,21,7,2016,4,1,0,23,50,7,1,1,1,,,,,,,50600024,"Iogurte, líquido meio gordo açucarado, natural","Yoghurt drink, semi-skimmed, with added sugar",A02NQ#F08.A032H$F10.A077G,"Yoghurt drinks, including sweetened and/or flavoured variants, SWEET= Sucrose (common sugar), QUAL= Semi-skimmed",187.2,,130.6656,5.8032,,,,20.9664,,0,2.6208,1.4976,.5616,.07488,156.4992,,,,.0936,,187.2,.3744,86.112,292.032,14.976,.7488,,,159.12,,.03744,.468,.3744,.0936,2.0592,0,0,61.776,35.568,0,.03744,,
1-01-01-0-10-002,2,32,1,21,7,2016,4,1,0,23,59,,,1,1,,,,,,,130500005,"Água, mineral não gaseificada","Minteral water, noncarbonated",A03DR,Still natural mineral water,260,,0,0,,,,0,,0,0,0,0,0,260,,,,0,,23.4,0,10.4,0,5.2,0,,,0,,0,0,0,0,0,0,0,0,0,0,0,,
1-01-01-0-10-002,2,32,2,4,8,2016,4,1,0,9,0,2,1,2,1,,,,,,,130500002,"Água, rede pública de abastecimento",Tap water,A03DL,Tap water,311.376,,0,0,,,,0,,0,0,0,0,0,311.064624,,,,0,,12.45504,0,6.22752,.622752,1.55688,.311376,,,0,,0,0,0,0,0,0,0,0,0,0,0,,
1-01-01-0-10-002,2,32,2,4,8,2016,4,1,0,9,0,2,1,2,1,,,,,,,110200003,"Açúcar, branco",White sugar,A032J,White sugar,1.8,,7.1496,0,,,,1.7874,,0,0,0,0,0,.009,,,,0,,.036,0,0,.036,0,0,,,0,,0,0,0,0,0,0,0,0,0,0,0,,
1-01-01-0-10-002,2,32,2,4,8,2016,4,1,0,9,0,2,1,1,1,,,,,,,100200001,"Manteiga, com sal","Butter, with salt",A039C#F10.A0CJK,"Butter, QUAL= With added salt",7.5,,55.455,.0075,,,,.0525,,0,6.135,3.4725,1.4175,.18,1.2,,,,.246,,1.125,.015,56.325,1.125,.15,.0075,,,1.8,,0,.0015,0,.00075,0,0,0,42.375,3.375,.0555,.15,,
1-01-01-0-10-002,2,32,2,4,8,2016,4,1,0,9,0,2,1,2,1,,,,,,,130404004,"Substituto de café, pó, cevada","Coffee imitate, powder, barley",A03HA,Barley coffee ingredient,12.2,,45.7012,.61,,,,9.882,,0,.4148,.0732,.0488,.2074,.2684,,,,0,,6.954,.5124,8.174,131.028,10.126,.0976,,,36.844,,0,.00366,1.952,0,0,0,0,0,0,0,0,,
1-01-01-0-10-002,2,32,2,4,8,2016,4,1,0,9,0,2,1,1,1,,,,,,,60301050,"Pão, trigo",Wheat bread,A004X,Wheat bread and rolls,58,,168.316,4.872,,,,33.234,,2.204,1.276,.29,.174,.464,15.196,,,,0,,24.94,1.276,353.8,70.18000000000001,17.98,.58,,,93.95999999999999,,.0232,.116,.754,.0406,16.82,0,0,0,0,0,0,,
1-01-01-0-10-002,2,32,2,4,8,2016,4,1,0,9,0,2,1,3,6,,,,,,,200201101,"Ácido fólico e vitamina B12, pastilha, comprimido, drageia ou cápsula","Folic acid and vitamin B12, tabs or capsules",A03SL#F04.A0EXQ$F04.A0EXP$F03.A06JH,"Vitamin only supplements, INGRED= Vitamin B9   (folic acid, folinic acid), INGRED= Vitamin B12 (cyanocobalamin, hydroxocobalamin, methylcobalamin), STATE= Tablets",.83,,0,0,,,,0,,0,0,0,0,0,0,,,,0,,0,28.0000000008,0,0,0,9.9999999991,,,0,,1.10000000015,1.40000000004,15.9999999969,1.40000000004,399.999999964,2.50000000019,39.9999999964,0,0,5.00000000038,0,,
1-01-01-0-10-002,2,32,2,4,8,2016,4,1,0,13,0,4,2,2,1,,,,,,,60301005,"Pão, trigo, carcaça","Wheat bread, roll",A004Y,"Wheat bread and rolls, white (refined flour)",41,,118.982,3.444,,,,23.493,,1.558,.902,.205,.123,.328,10.742,,,,0,,17.63,.902,250.1,49.61,12.71,.41,,,66.42,,.0164,.082,.533,.0287,11.89,0,0,0,0,0,0,,
1-01-01-0-10-002,2,32,2,4,8,2016,4,1,0,13,0,4,2,4,1,,,,,,,110200003,"Açúcar, branco",White sugar,A032J,White sugar,6,,23.832,0,,,,5.958,,0,0,0,0,0,.03,,,,0,,.12,0,0,.12,0,0,,,0,,0,0,0,0,0,0,0,0,0,0,0,,
1-01-01-0-10-002,2,32,2,4,8,2016,4,1,0,13,0,4,2,1,1,,,,,,,80300005,"Amêijoa, crua","Clams, raw",A02HA,Clams,40,,26.12,4.68,,,,1.04,,0,.36,.08,.04,.08,32.44,,,,0,,20.4,3.4,97.59999999999999,31.2,41.2,.84,,,71.2,,.016,.06,.6800000000000001,.016,3.8,14.8,0,38.8,0,.04,.116,,
1-01-01-0-10-002,2,32,2,4,8,2016,4,1,0,13,0,4,2,4,1,,,,,,,130401005,"Café, expresso com cafeína",Coffee espresso,A03KB,Coffee espresso (beverage),29,,1.073,.116,,,,.087,,0,.029,0,0,.029,27.898,,,,0,,.87,0,.87,77.14,2.9,0,,,3.19,,0,0,.203,0,0,0,0,0,0,0,0,,
1-01-01-0-10-002,2,32,2,4,8,2016,4,1,0,13,0,4,2,3,1,,,,,,,130200043,"Sumo, fresco de laranja, espremida","Juice, 100% fruit, orange",A03AM,"Juice, orange",323.4,,120.3048,1.9404,,,,26.1954,,1.9404,0,0,0,0,283.6218,,,,0,,38.808,.9702,6.468,582.12,38.808,0,,,71.148,,.25872,.06468,.6468,.22638,90.55200000000001,0,155.232,9.702,58.212,0,.5497800000000001,,
1-01-01-0-10-002,2,32,2,4,8,2016,4,1,0,13,0,4,2,6,1,,,,,,,999900131,Molho verde,Green sauce,A045K,Salad dressing,10,,45.7406,.0499,,,,.0724,,.0492,4.993,.6735,3.06,1.204,3.7256,,,,.0036,,2.388,.0392,400.664,10.852,3.572,.0144,,,1.4,,.00484,.00068,.0168,.00472,1.676,0,1.92,4.464,26.8,0,1.4262,,
1-01-01-0-10-002,2,32,2,4,8,2016,4,1,0,13,0,4,2,2,1,,,,,,,70500020,"Fiambre, n.e.",Cooked pork ham,A023K,Cooked pork ham,18,,18.9774,3.078,,,,.3096,,0,.603,.0576,.414,.1026,13.14,,,,0,,1.5732,.1368,127.26,69.12000000000001,4.5,.2484,,,33.84,,.0864,.036,.7092000000000001,.045,.5580000000000001,0,1.908,0,0,0,.0144,,
1-01-01-0-10-002,2,32,2,4,8,2016,4,1,0,13,0,4,2,2,1,,,,,,,50800001,"Queijo, n.e.",Cheese,A02QE,Cheese,16.56,,58.39056,4.14,,,,.04968,,0,4.58712,2.91456,1.09296,.13248,6.50808,,,,.175536,,133.9704,.04968,72.864,13.248,4.968,.59616,,,86.4432,,.018216,.104328,.0828,.019872,2.88144,.86112,0,38.35296,18.835344,.03312,.0828,,
1-01-01-0-10-002,2,32,2,4,8,2016,4,1,0,13,0,4,2,7,3,RCP_1219,Camarões fritos,Seafood-based meals,A03XM,Seafood-based meals,95,20800005,"Alho, cru","Garlic, raw",A00GZ,Garlic,4.655,,3.34229,.17689,,,,.526015,,.13965,.02793,.004655,0,.013965,3.71469,,,,0,,.79135,.03724,.4655,16.1063,.79135,.032585,,,4.0033,,.00879795,.00088445,.0265335,.0159201,.097755,0,.6726475,0,0,0,.0004655,,
1-01-01-0-10-002,2,32,2,4,8,2016,4,1,0,13,0,4,2,7,3,RCP_1219,Camarões fritos,Seafood-based meals,A03XM,Seafood-based meals,95,150500006,"Sal, n.e.",Salt,A042P,Salt,.298571,,0,0,,,,0,,0,0,0,0,0,0,,,,0,,0,0,119.4284,0,.895713,0,,,0,,0,0,0,0,0,0,0,0,0,0,0,,
1-01-01-0-10-002,2,32,2,4,8,2016,4,1,0,13,0,4,2,7,3,RCP_1219,Camarões fritos,Seafood-based meals,A03XM,Seafood-based meals,95,80300019,"Camarão, cru","Shrimp, raw",A02GB,"Shrimps, common",60.820357,,44.6907983236,10.1691636904,,,,.182461071,,0,.364922142,.060820357,.060820357,.182461071,48.169722744,,,,0,,52.91371059,.9305514621,100.292768693,92.53817317550001,16.42149639,.182461071,,,82.10748194999999,,.01459688568,.00547383213,1.094766426,.0243281428,4.379065704,1.1495047473,0,0,0,0,.425742499,,
1-01-01-0-10-002,2,32,2,4,8,2016,4,1,0,13,0,4,2,7,3,RCP_1219,Camarões fritos,Seafood-based meals,A03XM,Seafood-based meals,95,100100009,"Azeite, n.e.",Olive oil,A036P,Olive oils,9.119999999999999,,82.03440000000001,.00912,,,,0,,0,9.11088,1.31328,7.16832,.62928,0,,,,0,,0,0,0,0,0,0,,,0,,0,0,0,0,0,0,0,0,0,0,1.2768,,
1-01-01-0-10-002,2,32,2,4,8,2016,4,1,0,13,0,4,2,2,3,RCP_583,Bife da vazia grelhado,Grilled beef steak,A03VV,Meat based dishes,114,70202009,"Vaca, bife, valor médio de acém, alcatra e lombo cru","Cow, steak, average value of chuck, rump and loin, raw",A01QX#F03.A06JA,"Cow, ox or bull fresh meat, STATE= Slices, steaks or other flat cuts",162.205714,,179.0426671132,32.2059445147,,,,0,,0,5.5798765616,2.919702852,2.919702852,.324411428,118.247965506,,,,.324411428,,13.138662834,2.270879996,82.72491414,360.09668508,31.711217087,5.839405704,,,233.008508161,,.081102857,.22059977104,5.596097133,.49634948484,22.059977104,2.595291424,0,0,0,.648822856,.05514994276,,
1-01-01-0-10-002,2,32,2,4,8,2016,4,1,0,13,0,4,2,2,3,RCP_583,Bife da vazia grelhado,Grilled beef steak,A03VV,Meat based dishes,114,150500006,"Sal, n.e.",Salt,A042P,Salt,.651429,,0,0,,,,0,,0,0,0,0,0,0,,,,0,,0,0,260.5716,0,1.954287,0,,,0,,0,0,0,0,0,0,0,0,0,0,0,,
1-01-01-0-10-002,2,32,2,4,8,2016,4,1,0,13,0,4,2,6,3,RCP_598,Polvo cozido,Boiled octopus,A03XM,Seafood-based meals,98,80300016,"Polvo, cru",Octopus,A02JE,"Octopus, common",195.216,,142.898112,30.453696,,,,0,,0,2.342592,.585648,.195216,1.171296,162.224496,,,,0,,25.37808,1.366512,505.60944,460.70976,83.94288,2.537808,,,322.1064,,.03318672,.0780864,2.4109176,.11615352,19.912032,2.2840272,0,5.270832,0,0,1.4250768,,
1-01-01-0-10-002,2,32,2,4,8,2016,4,1,0,13,0,4,2,6,3,RCP_598,Polvo cozido,Boiled octopus,A03XM,Seafood-based meals,98,150500006,"Sal, n.e.",Salt,A042P,Salt,.784,,0,0,,,,0,,0,0,0,0,0,0,,,,0,,0,0,313.6,0,2.352,0,,,0,,0,0,0,0,0,0,0,0,0,0,0,,
1-01-01-0-10-002,2,32,2,4,8,2016,4,1,0,13,0,4,2,5,6,,,,,,,200202503,"Ferro, pastilha, comprimido, drageia ou cápsula","Iron, tabs or capsules",A03SM#F04.A0EXD$F03.A06JH,"Mineral only supplements, INGRED= Iron, STATE= Tablets",.83,,0,0,,,,0,,0,0,0,0,0,0,,,,0,,0,94.857142869,0,0,0,0,,,0,,0,0,0,0,0,0,22.134025,0,0,0,0,,
1-01-01-0-10-002,2,32,2,4,8,2016,4,1,0,15,0,5,1,1,1,,,,,,,50600024,"Iogurte, líquido meio gordo açucarado, natural","Yoghurt drink, semi-skimmed, with added sugar",A02NQ#F08.A032H$F10.A077G,"Yoghurt drinks, including sweetened and/or flavoured variants, SWEET= Sucrose (common sugar), QUAL= Semi-skimmed",187.2,,130.6656,5.8032,,,,20.9664,,0,2.6208,1.4976,.5616,.07488,156.4992,,,,.0936,,187.2,.3744,86.112,292.032,14.976,.7488,,,159.12,,.03744,.468,.3744,.0936,2.0592,0,0,61.776,35.568,0,.03744,,
1-01-01-0-10-002,2,32,2,4,8,2016,4,1,0,18,30,5,2,5,1,,,,,,,70302008,"Frango, coxa","Chicken, leg",A01SP#F02.A07XQ,"Chicken fresh meat, PART= Leg (as part-nature)",46.7325,,67.8088575,9.066105,,,,0,,0,3.5049375,1.14494625,1.51880625,.89259075,32.1986925,,,,0,,2.24316,.37386,26.637525,137.39355,9.346500000000001,.467325,,,85.52047500000001,,.037386,.0654255,3.271275,.15421725,4.67325,.18693,0,9.346500000000001,0,.7009875,.2897415,,
1-01-01-0-10-002,2,32,2,4,8,2016,4,1,0,18,30,5,2,1,1,,,,,,,60301011,"Pão, chapata","Wheat bread, roll",A004Y,"Wheat bread and rolls, white (refined flour)",60,,164.28,4.92,,,,30.6,,1.38,2.16,.486,.966,.444,22.02,,,,0,,27.3,1.818,178.8,71.40000000000001,14.4,.372,,,56.4,,.282,.204,1.5,.036,17.4,.018,0,0,0,0,.12,,
1-01-01-0-10-002,2,32,2,4,8,2016,4,1,0,18,30,5,2,4,1,,,,,,,110200003,"Açúcar, branco",White sugar,A032J,White sugar,6,,23.832,0,,,,5.958,,0,0,0,0,0,.03,,,,0,,.12,0,0,.12,0,0,,,0,,0,0,0,0,0,0,0,0,0,0,0,,
1-01-01-0-10-002,2,32,2,4,8,2016,4,1,0,18,30,5,2,4,1,,,,,,,130401012,"Café, expresso, descafeinado",Coffee beverage decaffeinated,A03KF,Coffee beverage decaffeinated,40,,1.376,.04,,,,.16,,0,.024,.012,0,.012,39,,,,.12,,1.32,.052,2.4,56,16.8,.036,,,3.32,,0,.028,.976,0,.12,0,.028,0,0,0,0,,
1-01-01-0-10-002,2,32,2,4,8,2016,4,1,0,18,30,5,2,3,1,,,,,,,110200015,"Doce, framboesa","Jam, raspberries",A01MP,"Jam, raspberries",20,,48.48,.08,,,,11.94,,.2,0,0,0,0,7.74,,,,0,,4.8,.2,3.2,21.8,2,.04,,,2.4,,0,0,0,0,0,0,0,0,0,0,0,,
1-01-01-0-10-002,2,32,2,4,8,2016,4,1,0,18,30,5,2,2,1,,,,,,,130300006,"Refrigerante, sem gás laranja","Soft drink, orange, without gas",A03EL,"Fruit soft drink, orange",313.1,,103.0099,0,,,,25.048,,0,0,0,0,0,274.43215,,,,0,,15.655,1.22109,15.655,37.572,6.262,.12524,,,6.262,,0,0,0,0,0,0,6.262,0,0,0,.03131,,
1-01-01-0-10-002,2,32,2,4,8,2016,4,1,0,18,30,5,2,1,3,RCP_132,Perna de porco assada,Roasted pork leg,A03VV,Meat based dishes,60,20800005,"Alho, cru","Garlic, raw",A00GZ,Garlic,.4,,.2872,.0152,,,,.0452,,.012,.0024,.0004,0,.0012,.3192,,,,0,,.068,.0032,.04,1.384,.068,.0028,,,.344,,.000756,.000076,.00228,.001368,.0084,0,.0578,0,0,0,.00004,,
1-01-01-0-10-002,2,32,2,4,8,2016,4,1,0,18,30,5,2,1,3,RCP_132,Perna de porco assada,Roasted pork leg,A03VV,Meat based dishes,60,150400028,Colorau,Paprika powder,A019L,Paprika powder,.4,,1.432,.0592,,,,.14,,.0836,.052,.0084,.0048,.0336,.0376,,,,0,,.72,.096,.136,9.359999999999999,.76,.0164,,,1.4,,.0026,.0068,.06,.0136,0,0,0,24.168,72.50400000000001,0,0,,
1-01-01-0-10-002,2,32,2,4,8,2016,4,1,0,18,30,5,2,1,3,RCP_132,Perna de porco assada,Roasted pork leg,A03VV,Meat based dishes,60,150500015,Piri-piri,Paprika powder,A019L,Paprika powder,.4,,.1068,.0064,,,,.0068,,0,.006,.0036,.0036,.0012,.3492,,,,0,,.1,.0096,6.08,.88,.104,.0008,,,.128,,.00028,.00064,.00272,.0008,.024,0,0,0,0,0,0,,
1-01-01-0-10-002,2,32,2,4,8,2016,4,1,0,18,30,5,2,1,3,RCP_132,Perna de porco assada,Roasted pork leg,A03VV,Meat based dishes,60,150500006,"Sal, n.e.",Salt,A042P,Salt,.4,,0,0,,,,0,,0,0,0,0,0,0,,,,0,,0,0,160,0,1.2,0,,,0,,0,0,0,0,0,0,0,0,0,0,0,,
1-01-01-0-10-002,2,32,2,4,8,2016,4,1,0,18,30,5,2,1,3,RCP_132,Perna de porco assada,Roasted pork leg,A03VV,Meat based dishes,60,70204011,"Porco, perna","Pig, leg",A01RG#F02.A07XQ,"Pig fresh meat, PART= Leg (as part-nature)",57.28,,109.5743488,10.9742752,,,,0,,0,7.297472,2.54896,2.49168,1.20288,37.74752,,,,.02864,,6.5872,.48688,40.9552,202.4848,12.0288,1.26016,,,106.2544,,.2927008,.1432,3.368064,.1512192,.45824,.45824,0,0,0,.297856,.254896,,
1-01-01-0-10-002,2,32,2,4,8,2016,4,1,0,18,30,5,2,1,3,RCP_132,Perna de porco assada,Roasted pork leg,A03VV,Meat based dishes,60,140200005,"Vinho, branco n.e.","Wine, white",A03MV,"Wine, white",3.2,,.5763200000000001,.0032,,,,.0832,,0,0,0,0,0,2.7808,,,,0,,.288,.00864,.16,2.272,.32,.00384,,,.576,,.00032,.00064,.00352,.0016,.032,0,0,0,0,0,0,,
1-01-01-0-10-002,2,32,2,4,8,2016,4,1,0,18,30,5,2,1,3,RCP_132,Perna de porco assada,Roasted pork leg,A03VV,Meat based dishes,60,100100009,"Azeite, n.e.",Olive oil,A036P,Olive oils,4.8,,43.176,.0048,,,,0,,0,4.7952,.6912,3.7728,.3312,0,,,,0,,0,0,0,0,0,0,,,0,,0,0,0,0,0,0,0,0,0,0,.672,,
1-01-01-0-10-002,2,32,2,4,8,2016,4,1,0,18,30,5,2,1,3,RCP_132,Perna de porco assada,Roasted pork leg,A03VV,Meat based dishes,60,150400029,"Salsa, crua","Parsley, raw",A00YE,Parsley,.4,,.0792,.0124,,,,.0016,,.0116,0,0,0,0,.3668,,,,0,,.8,.0128,.136,2.984,.136,.0036,,,.364,,.00112,.00024,.0024,.00036,.668,0,.88,2.232,13.4,0,.0076,,
1-01-01-0-10-002,2,32,2,4,8,2016,4,1,0,18,30,5,2,7,3,RCP_763,Sopa à lavrador,"Pasta, potatoes, cabbage and green beans soup",A041S,Mixed vegetables soup,230,20200015,"Grelos, de couve crus","Rapini, kale raw",A00FL#F01.A05BM,"Flowering brassica, SOURCE= Kale (as plant)",22.140526,,6.287909384,.531372624,,,,.55351315,,.575653676,.088562104,.022140526,0,.066421578,20.280721816,,,,0,,32.54657322,.132843156,4.20669994,51.80883084,4.4281052,.154983682,,,11.29166826,,.01239869456,.01893014973,.1472344979,.02789706276,13.94853138,0,9.620058546999999,39.8529468,214.807383252,0,.287826838,,