id,hh_id,country,sec_area,tert_area,round,smpl_weight,sex,age,edc_level,edc,residence,preg_lact,breastfeeding,hh_head,wgt,wgt_method,hgt,hgt_method,bmi_adults,bmi_children,bmi_cat,misrep,pa,pa_cat,smok,special_diet,special_diet_other,clin_diet,clin_diet_other,note,bmi_chld
1,,Guatemala,Chimaltenango,Chimaltenango,1,,2,22,2,,1,1,,,51.400002,1,147.10001,1,23.754055,,2,,,,,0,,0,,,
2,,Guatemala,Chimaltenango,Chimaltenango,1,,2,23,2,,1,1,,,43.700001,1,152.5,1,18.790648,,2,,,,,0,,0,,,
3,,Guatemala,Chimaltenango,Chimaltenango,1,,2,31,2,,1,1,,,65.400002,1,151.60001,1,28.456358,,3,,,,,0,,0,,,
4,,Guatemala,Chimaltenango,Chimaltenango,1,,2,20,2,,1,1,,,45.299999,1,144.7,1,21.635212,,2,,,,,0,,0,,,
5,,Guatemala,Chimaltenango,Chimaltenango,1,,2,18,2,,1,1,,,58.299999,1,149.8,1,,,,,,,,0,,0,,,25.980345
6,,Guatemala,Chimaltenango,Chimaltenango,1,,2,19,2,,1,1,,,51,1,146.7,1,,,,,,,,0,,0,,,23.697906
7,,Guatemala,Chimaltenango,Chimaltenango,1,,2,22,2,,1,1,,,,,146.8,1,,,,,,,,0,,0,,Missing value for weight,
8,,Guatemala,Chimaltenango,Chimaltenango,1,,2,19,3,,1,1,,,41.599998,1,140.10001,1,,,,,,,,0,,0,,,21.194199
9,,Guatemala,Chimaltenango,Chimaltenango,1,,2,24,2,,1,1,,,46,1,143.5,1,22.338501,,2,,,,,0,,0,,,
10,,Guatemala,Chimaltenango,Chimaltenango,1,,2,29,2,,1,1,,,58.700001,1,153.5,1,24.912731,,2,,,,,0,,0,,,
11,,Guatemala,Chimaltenango,Chimaltenango,1,,2,24,3,,1,1,,,84.400002,1,158,1,33.808685,,4,,,,,0,,0,,,
12,,Guatemala,Chimaltenango,Chimaltenango,1,,2,23,3,,1,1,,,53.900002,1,153.39999,1,22.905411,,2,,,,,0,,0,,,
13,,Guatemala,Chimaltenango,Chimaltenango,1,,2,21,2,,1,1,,,52.200001,1,141.60001,1,26.034184,,3,,,,,0,,0,,,
14,,Guatemala,Chimaltenango,Chimaltenango,1,,2,20,3,,1,1,,,55,1,132.2,1,31.470221,,4,,,,,0,,0,,,
15,,Guatemala,Chimaltenango,Chimaltenango,1,,2,18,1,,1,1,,,47.400002,1,146.5,1,,,,,,,,0,,0,,,22.085291
16,,Guatemala,Chimaltenango,Chimaltenango,1,,2,26,2,,1,1,,,49.299999,1,145.60001,1,23.255417,,2,,,,,0,,0,,,
17,,Guatemala,Chimaltenango,Chimaltenango,1,,2,31,2,,1,1,,,48.400002,1,149.60001,1,21.626297,,2,,,,,0,,0,,,
18,,Guatemala,Chimaltenango,Chimaltenango,1,,2,30,2,,1,1,,,62.799999,1,145.2,1,29.786976,,3,,,,,0,,0,,,
19,,Guatemala,Chimaltenango,Chimaltenango,1,,2,32,2,,1,1,,,52.700001,1,140.5,1,26.696724,,3,,,,,0,,0,,,
20,,Guatemala,Chimaltenango,Chimaltenango,1,,2,18,3,,1,1,,,50,1,149.2,1,,,,,,,,0,,0,,,22.46117
21,,Guatemala,Chimaltenango,Chimaltenango,1,,2,32,2,,1,1,,,65.699997,1,144.2,1,31.596199,,4,,,,,0,,0,,,
22,,Guatemala,Chimaltenango,Chimaltenango,1,,2,31,1,,1,1,,,45,1,140.8,1,22.699024,,2,,,,,0,,0,,,
23,,Guatemala,Chimaltenango,Chimaltenango,1,,2,33,2,,1,1,,,53.400002,1,143,1,26.113747,,3,,,,,0,,0,,,
24,,Guatemala,Chimaltenango,Chimaltenango,1,,2,32,2,,1,1,,,76,1,147,1,35.170532,,4,,,,,0,,0,,,
25,,Guatemala,Chimaltenango,Chimaltenango,1,,2,25,2,,1,1,,,43,1,143.5,1,20.881643,,2,,,,,0,,0,,,
26,,Guatemala,Chimaltenango,Chimaltenango,1,,2,24,1,,1,1,,,44,1,139.89999,1,22.481087,,2,,,,,0,,0,,,
27,,Guatemala,Chimaltenango,Chimaltenango,1,,2,29,2,,1,1,,,48.5,1,151.10001,1,21.242849,,2,,,,,0,,0,,,
28,,Guatemala,Chimaltenango,Chimaltenango,1,,2,30,2,,1,1,,,62,1,139.7,1,31.76866,,4,,,,,0,,0,,,
29,,Guatemala,Chimaltenango,Chimaltenango,1,,2,25,3,,1,1,,,54.200001,1,140.3,1,27.534927,,3,,,,,0,,0,,,
30,,Guatemala,Chimaltenango,Chimaltenango,1,,2,29,2,,1,1,,,64.599998,1,141.39999,1,32.309761,,4,,,,,0,,0,,,
31,,Guatemala,Chimaltenango,Chimaltenango,1,,2,26,2,,1,1,,,43,1,139.3,1,22.159819,,2,,,,,0,,0,,,
32,,Guatemala,Chimaltenango,Chimaltenango,1,,2,25,1,,1,1,,,54.400002,1,136,1,29.411766,,3,,,,,0,,0,,,
33,,Guatemala,Chimaltenango,Chimaltenango,1,,2,31,1,,1,1,,,41.900002,1,142.5,1,20.634043,,2,,,,,0,,0,,,
34,,Guatemala,Chimaltenango,Chimaltenango,1,,2,30,2,,1,1,,,57.900002,1,150,1,25.733334,,3,,,,,0,,0,,,
35,,Guatemala,Chimaltenango,Chimaltenango,1,,2,27,3,,1,1,,,55.799999,1,144.89999,1,26.576481,,3,,,,,0,,0,,,
36,,Guatemala,Chimaltenango,Chimaltenango,1,,2,28,2,,1,1,,,54.5,1,146.10001,1,25.532658,,3,,,,,0,,0,,,
37,,Guatemala,Chimaltenango,Chimaltenango,1,,2,27,3,,1,1,,,55.200001,1,156,1,22.682446,,2,,,,,0,,0,,,
38,,Guatemala,Chimaltenango,Chimaltenango,1,,2,30,2,,1,1,,,60.5,1,146.10001,1,28.343594,,3,,,,,0,,0,,,
39,,Guatemala,Chimaltenango,Chimaltenango,1,,2,30,3,,1,1,,,46.599998,1,141.5,1,23.274107,,2,,,,,0,,0,,,
40,,Guatemala,Chimaltenango,Chimaltenango,1,,2,31,2,,1,1,,,51.700001,1,147.3,1,23.82786,,2,,,,,0,,0,,,
41,,Guatemala,Chimaltenango,Chimaltenango,1,,2,31,2,,1,1,,,51.099998,1,151.60001,1,22.234249,,2,,,,,0,,0,,,
42,,Guatemala,Chimaltenango,Chimaltenango,1,,2,22,2,,1,1,,,51.700001,1,151.8,1,22.436081,,2,,,,,0,,0,,,
43,,Guatemala,Chimaltenango,Chimaltenango,1,,2,22,3,,1,1,,,42.400002,1,144.2,1,20.390852,,2,,,,,0,,0,,,
44,,Guatemala,Chimaltenango,Chimaltenango,1,,2,24,2,,1,1,,,47.900002,1,149.3,1,21.488985,,2,,,,,0,,0,,,
45,,Guatemala,Chimaltenango,Chimaltenango,1,,2,21,2,,1,1,,,49.099998,1,144.2,1,23.612989,,2,,,,,0,,0,,,
46,,Guatemala,Chimaltenango,Chimaltenango,1,,2,25,1,,1,1,,,40.400002,1,142.5,1,19.895353,,2,,,,,0,,0,,,
47,,Guatemala,Chimaltenango,Chimaltenango,1,,2,29,2,,1,1,,,64.900002,1,142.8,1,31.826456,,4,,,,,0,,0,,,
48,,Guatemala,Chimaltenango,Chimaltenango,1,,2,23,3,,1,1,,,43.700001,1,138.89999,1,22.650457,,2,,,,,0,,0,,,
49,,Guatemala,Chimaltenango,Chimaltenango,1,,2,24,2,,1,1,,,56.299999,1,144.60001,1,26.925995,,3,,,,,0,,0,,,
50,,Guatemala,Chimaltenango,Chimaltenango,1,,2,23,3,,1,1,,,39.099998,1,140.3,1,19.863756,,2,,,,,0,,0,,,
51,,Guatemala,Chimaltenango,Chimaltenango,1,,2,20,3,,1,1,,,50.799999,1,147.5,1,23.349611,,2,,,,,0,,0,,,
52,,Guatemala,Chimaltenango,Chimaltenango,1,,2,32,2,,1,1,,,55,1,144.89999,1,26.195456,,3,,,,,0,,0,,,
53,,Guatemala,Chimaltenango,Chimaltenango,1,,2,32,2,,1,1,,,49.5,1,144.3,1,23.772371,,2,,,,,0,,0,,,
54,,Guatemala,Chimaltenango,Chimaltenango,1,,2,26,1,,1,1,,,51.599998,1,140.5,1,26.139486,,3,,,,,0,,0,,,
55,,Guatemala,Chimaltenango,Chimaltenango,1,,2,28,3,,1,1,,,58.299999,1,142.5,1,28.710373,,3,,,,,0,,0,,,
56,,Guatemala,Chimaltenango,Chimaltenango,1,,2,26,3,,1,1,,,49.799999,1,144.7,1,23.784405,,2,,,,,0,,0,,,
57,,Guatemala,Chimaltenango,Chimaltenango,1,,2,20,3,,1,1,,,45.099998,1,142,1,22.366592,,2,,,,,0,,0,,,
58,,Guatemala,Chimaltenango,Chimaltenango,1,,2,29,2,,1,1,,,53.099998,1,147.10001,1,24.539694,,2,,,,,0,,0,,,
59,,Guatemala,Chimaltenango,Chimaltenango,1,,2,23,2,,1,1,,,47,1,147.2,1,21.691133,,2,,,,,0,,0,,,
60,,Guatemala,Chimaltenango,Chimaltenango,1,,2,26,1,,1,1,,,60.299999,1,139.89999,1,30.809305,,4,,,,,0,,0,,,
61,,Guatemala,Chimaltenango,Chimaltenango,1,,2,23,2,,1,1,,,41.900002,1,150.3,1,18.547956,,2,,,,,0,,0,,,
62,,Guatemala,Chimaltenango,Chimaltenango,1,,2,20,2,,1,1,,,41.700001,1,142.60001,1,20.506756,,2,,,,,0,,0,,,
63,,Guatemala,Chimaltenango,Chimaltenango,1,,2,25,3,,1,1,,,57.5,1,149.8,1,25.623838,,3,,,,,0,,0,,,
64,,Guatemala,Chimaltenango,Chimaltenango,1,,2,29,3,,1,1,,,62.099998,1,145,1,29.536266,,3,,,,,0,,0,,,
65,,Guatemala,Chimaltenango,Chimaltenango,1,,2,17,2,,1,1,,,41,1,146.5,1,,,,,,,,0,,0,,,19.10331
66,,Guatemala,Chimaltenango,Chimaltenango,1,,2,21,2,,1,1,,,47.099998,1,138.39999,1,24.589447,,2,,,,,0,,0,,,
67,,Guatemala,Chimaltenango,Chimaltenango,1,,2,31,2,,1,1,,,56,1,157,1,22.718975,,2,,,,,0,,0,,,
68,,Guatemala,Chimaltenango,Chimaltenango,1,,2,30,2,,1,1,,,52.400002,1,147.3,1,24.15048,,2,,,,,0,,0,,,
69,,Guatemala,Chimaltenango,Chimaltenango,1,,2,23,2,,1,1,,,,,149,1,,,,,,,,0,,0,,Missing value for weight,
70,,Guatemala,Chimaltenango,Chimaltenango,1,,2,26,2,,1,1,,,48.400002,1,138.2,1,25.341324,,3,,,,,0,,0,,,
71,,Guatemala,Chimaltenango,Chimaltenango,1,,2,28,2,,1,1,,,59.900002,1,142.89999,1,29.333401,,3,,,,,0,,0,,,
72,,Guatemala,Chimaltenango,Chimaltenango,1,,2,24,2,,1,1,,,54.099998,1,139.89999,1,27.641516,,3,,,,,0,,0,,,
73,,Guatemala,Chimaltenango,Chimaltenango,1,,2,31,3,,1,1,,,46.400002,1,146.3,1,21.678505,,2,,,,,0,,0,,,
74,,Guatemala,Chimaltenango,Chimaltenango,1,,2,26,3,,1,1,,,42.900002,1,146.60001,1,19.961323,,2,,,,,0,,0,,,
75,,Guatemala,Chimaltenango,Chimaltenango,1,,2,28,2,,1,1,,,50.099998,1,152,1,21.684557,,2,,,,,0,,0,,,
77,,Guatemala,Chimaltenango,Chimaltenango,1,,2,31,2,,1,1,,,68,1,155.3,1,28.194603,,3,,,,,0,,0,,,
78,,Guatemala,Chimaltenango,Chimaltenango,1,,2,25,2,,1,1,,,41.700001,1,141,1,20.9748,,2,,,,,0,,0,,,
79,,Guatemala,Chimaltenango,Chimaltenango,1,,2,29,2,,1,1,,,61,1,144.5,1,29.214211,,3,,,,,0,,0,,,
80,,Guatemala,Chimaltenango,Chimaltenango,1,,2,26,2,,1,1,,,49.5,1,146.5,1,23.063751,,2,,,,,0,,0,,,
81,,Guatemala,Chimaltenango,Chimaltenango,1,,2,29,2,,1,1,,,48.099998,1,141,1,24.193953,,2,,,,,0,,0,,,
82,,Guatemala,Chimaltenango,Chimaltenango,1,,2,24,2,,1,1,,,,,141,1,,,,,,,,0,,0,,Missing value for weight,
83,,Guatemala,Chimaltenango,Chimaltenango,1,,2,30,3,,1,1,,,51.099998,1,148.2,1,23.26615,,2,,,,,0,,0,,,
84,,Guatemala,Chimaltenango,Chimaltenango,1,,2,25,2,,1,1,,,55.700001,1,143.89999,1,26.898846,,3,,,,,0,,0,,,
85,,Guatemala,Chimaltenango,Chimaltenango,1,,2,26,2,,1,1,,,79.400002,1,157.5,1,32.008064,,4,,,,,0,,0,,,
86,,Guatemala,Chimaltenango,Chimaltenango,1,,2,26,2,,1,1,,,63.900002,1,144.2,1,30.730553,,4,,,,,0,,0,,,
87,,Guatemala,Chimaltenango,Chimaltenango,1,,2,27,2,,1,1,,,65.300003,1,144.5,1,31.273573,,4,,,,,0,,0,,,
88,,Guatemala,Chimaltenango,Chimaltenango,1,,2,19,2,,1,1,,,,,151,1,,,,,,,,0,,0,,Missing value for weight,
89,,Guatemala,Chimaltenango,Chimaltenango,1,,2,27,2,,1,1,,,66.5,1,147.3,1,30.648987,,4,,,,,0,,0,,,
90,,Guatemala,Chimaltenango,Chimaltenango,1,,2,19,2,,1,1,,,,,148.89999,1,,,,,,,,0,,0,,Missing value for weight,
91,,Guatemala,Chimaltenango,Chimaltenango,1,,2,24,2,,1,1,,,60.700001,1,138,1,31.873556,,4,,,,,0,,0,,,
92,,Guatemala,Chimaltenango,Chimaltenango,1,,2,27,3,,1,1,,,52.400002,1,154.3,1,22.008955,,2,,,,,0,,0,,,
93,,Guatemala,Chimaltenango,Chimaltenango,1,,2,32,2,,1,1,,,57.900002,1,149.3,1,25.975203,,3,,,,,0,,0,,,
94,,Guatemala,Chimaltenango,Chimaltenango,1,,2,28,3,,1,1,,,49.200001,1,149,1,22.161163,,2,,,,,0,,0,,,
95,,Guatemala,Chimaltenango,Chimaltenango,1,,2,24,2,,1,1,,,36.200001,1,141.8,1,18.003466,,1,,,,,0,,0,,,
96,,Guatemala,Chimaltenango,Chimaltenango,1,,2,26,2,,1,1,,,59.700001,1,141.8,1,29.690798,,3,,,,,0,,0,,,
97,,Guatemala,Chimaltenango,Chimaltenango,1,,2,23,2,,1,1,,,49.299999,1,142.10001,1,24.415112,,2,,,,,0,,0,,,
98,,Guatemala,Chimaltenango,Chimaltenango,1,,2,22,2,,1,1,,,56.200001,1,144,1,27.102623,,3,,,,,0,,0,,,
99,,Guatemala,Chimaltenango,Chimaltenango,1,,2,27,3,,1,1,,,51.700001,1,136.60001,1,27.706974,,3,,,,,0,,0,,,
100,,Guatemala,Chimaltenango,Chimaltenango,1,,2,30,2,,1,1,,,66.400002,1,147.2,1,30.644497,,4,,,,,0,,0,,,
101,,Guatemala,Chimaltenango,Chimaltenango,1,,2,20,2,,1,1,,,60,1,147.10001,1,27.728468,,3,,,,,0,,0,,,
102,,Guatemala,Chimaltenango,Chimaltenango,1,,2,33,3,,1,1,,,55.099998,1,140.8,1,27.793694,,3,,,,,0,,0,,,
103,,Guatemala,Chimaltenango,Chimaltenango,1,,2,22,3,,1,1,,,43.599998,1,150.60001,1,19.223679,,2,,,,,0,,0,,,
104,,Guatemala,Chimaltenango,Chimaltenango,1,,2,25,2,,1,1,,,72.199997,1,146.5,1,33.640461,,4,,,,,0,,0,,,
105,,Guatemala,Chimaltenango,Chimaltenango,1,,2,24,3,,1,1,,,52.400002,1,146,1,24.582474,,2,,,,,0,,0,,,
106,,Guatemala,Chimaltenango,Chimaltenango,1,,2,30,2,,1,1,,,,,140.60001,1,,,,,,,,0,,0,,Missing value for weight,
108,,Guatemala,Chimaltenango,Chimaltenango,1,,2,28,1,,1,1,,,53,1,138.39999,1,27.669655,,3,,,,,0,,0,,,
109,,Guatemala,Chimaltenango,Chimaltenango,1,,2,24,2,,1,1,,,51,1,133.60001,1,28.573092,,3,,,,,0,,0,,,
110,,Guatemala,Chimaltenango,Chimaltenango,1,,2,22,2,,1,1,,,,,144.39999,1,,,,,,,,0,,0,,Missing value for weight,
111,,Guatemala,Chimaltenango,Chimaltenango,1,,2,20,2,,1,1,,,47.599998,1,144.60001,1,22.765139,,2,,,,,0,,0,,,
112,,Guatemala,Chimaltenango,Chimaltenango,1,,2,20,2,,1,1,,,44.299999,1,143.5,1,21.512947,,2,,,,,0,,0,,,
113,,Guatemala,Chimaltenango,Chimaltenango,1,,2,22,2,,1,1,,,43.5,1,145.3,1,20.604307,,2,,,,,0,,0,,,
114,,Guatemala,Chimaltenango,Chimaltenango,1,,2,24,2,,1,1,,,57.5,1,151.89999,1,24.920246,,2,,,,,0,,0,,,
115,,Guatemala,Chimaltenango,Chimaltenango,1,,2,20,3,,1,1,,,44.5,1,144.2,1,21.400776,,2,,,,,0,,0,,,
116,,Guatemala,Chimaltenango,Chimaltenango,1,,2,30,3,,1,1,,,,,149,1,,,,,,,,0,,0,,Missing value for weight,
117,,Guatemala,Chimaltenango,Chimaltenango,1,,2,31,2,,1,1,,,53.400002,1,145.3,1,25.293564,,3,,,,,0,,0,,,
118,,Guatemala,Chimaltenango,Chimaltenango,1,,2,22,2,,1,1,,,56.900002,1,145.8,1,26.766848,,3,,,,,0,,0,,,
119,,Guatemala,Chimaltenango,Chimaltenango,1,,2,31,3,,1,1,,,55.900002,1,144.60001,1,26.734694,,3,,,,,0,,0,,,
120,,Guatemala,Chimaltenango,Chimaltenango,1,,2,22,1,,1,1,,,40,1,139,1,20.702862,,2,,,,,0,,0,,,
121,,Guatemala,Chimaltenango,Chimaltenango,1,,2,25,2,,1,1,,,49.400002,1,135.8,1,26.787205,,3,,,,,0,,0,,,
122,,Guatemala,Chimaltenango,Chimaltenango,1,,2,21,3,,1,1,,,40.400002,1,150.89999,1,17.742014,,1,,,,,0,,0,,,
123,,Guatemala,Chimaltenango,Chimaltenango,1,,2,30,3,,1,1,,,55.900002,1,141.2,1,28.037704,,3,,,,,0,,0,,,
124,,Guatemala,Chimaltenango,Chimaltenango,1,,2,32,2,,1,1,,,53.5,1,142.39999,1,26.383587,,3,,,,,0,,0,,,
125,,Guatemala,Chimaltenango,Chimaltenango,1,,2,24,2,,1,1,,,42.5,1,145.5,1,20.075342,,2,,,,,0,,0,,,
126,,Guatemala,Chimaltenango,Chimaltenango,1,,2,31,2,,1,1,,,,,146.60001,1,,,,,,,,0,,0,,Missing value for weight,
127,,Guatemala,Chimaltenango,Chimaltenango,1,,2,22,3,,1,1,,,64.800003,1,148.89999,1,29.227097,,3,,,,,0,,0,,,
128,,Guatemala,Chimaltenango,Chimaltenango,1,,2,30,2,,1,1,,,42.400002,1,141.8,1,21.086931,,2,,,,,0,,0,,,
129,,Guatemala,Chimaltenango,Chimaltenango,1,,2,28,2,,1,1,,,77.900002,1,147.3,1,35.903099,,4,,,,,0,,0,,,
130,,Guatemala,Chimaltenango,Chimaltenango,1,,2,23,2,,1,1,,,45.099998,1,142.8,1,22.116688,,2,,,,,0,,0,,,
131,,Guatemala,Chimaltenango,Chimaltenango,1,,2,33,2,,1,1,,,47.599998,1,144.7,1,22.733688,,2,,,,,0,,0,,,
132,,Guatemala,Chimaltenango,Chimaltenango,1,,2,25,2,,1,1,,,48.599998,1,139,1,25.153976,,3,,,,,0,,0,,,
133,,Guatemala,Chimaltenango,Chimaltenango,1,,2,28,2,,1,1,,,64.699997,1,143.39999,1,31.463425,,4,,,,,0,,0,,,
134,,Guatemala,Chimaltenango,Chimaltenango,1,,2,29,2,,1,1,,,42.400002,1,136.89999,1,22.623459,,2,,,,,0,,0,,,
135,,Guatemala,Chimaltenango,Chimaltenango,1,,2,24,2,,1,1,,,48.200001,1,141.5,1,24.073219,,2,,,,,0,,0,,,
136,,Guatemala,Chimaltenango,Chimaltenango,1,,2,22,1,,1,1,,,39.200001,1,132.89999,1,22.194029,,2,,,,,0,,0,,,
137,,Guatemala,Chimaltenango,Chimaltenango,1,,2,17,2,,1,1,,,50.5,1,145.10001,1,,,,,,,,0,,0,,,23.985928
138,,Guatemala,Chimaltenango,Chimaltenango,1,,2,26,2,,1,1,,,57.400002,1,143.3,1,27.952425,,3,,,,,0,,0,,,
139,,Guatemala,Chimaltenango,Chimaltenango,1,,2,27,2,,1,1,,,50,1,144.5,1,23.946074,,2,,,,,0,,0,,,
140,,Guatemala,Chimaltenango,Chimaltenango,1,,2,27,2,,1,1,,,54.799999,1,148.89999,1,24.71674,,2,,,,,0,,0,,,
141,,Guatemala,Chimaltenango,Chimaltenango,1,,2,24,2,,1,1,,,42.900002,1,142.39999,1,21.156185,,2,,,,,0,,0,,,
142,,Guatemala,Chimaltenango,Chimaltenango,1,,2,24,2,,1,1,,,60.200001,1,150.2,1,26.684351,,3,,,,,0,,0,,,
143,,Guatemala,Chimaltenango,Chimaltenango,1,,2,23,2,,1,1,,,42.200001,1,146.60001,1,19.635614,,2,,,,,0,,0,,,
144,,Guatemala,Chimaltenango,Chimaltenango,1,,2,24,2,,1,1,,,60.700001,1,148,1,27.711834,,3,,,,,0,,0,,,
145,,Guatemala,Chimaltenango,Chimaltenango,1,,2,22,3,,1,1,,,43.099998,1,139.60001,1,22.11599,,2,,,,,0,,0,,,
146,,Guatemala,Chimaltenango,Chimaltenango,1,,2,23,2,,1,1,,,51.700001,1,140.39999,1,26.227468,,3,,,,,0,,0,,,
147,,Guatemala,Chimaltenango,Chimaltenango,1,,2,23,2,,1,1,,,44.900002,1,143.7,1,21.74367,,2,,,,,0,,0,,,
148,,Guatemala,Chimaltenango,Chimaltenango,1,,2,21,2,,1,1,,,47.400002,1,141.2,1,23.774368,,2,,,,,0,,0,,,
149,,Guatemala,Chimaltenango,Chimaltenango,1,,2,33,1,,1,1,,,51.099998,1,141,1,25.702932,,3,,,,,0,,0,,,
150,,Guatemala,Chimaltenango,Chimaltenango,1,,2,22,2,,1,1,,,50.700001,1,145.2,1,24.047768,,2,,,,,0,,0,,,
151,,Guatemala,Chimaltenango,Chimaltenango,1,,2,33,1,,1,1,,,55.599998,1,149,1,25.043917,,3,,,,,0,,0,,,
153,,Guatemala,Chimaltenango,Chimaltenango,1,,2,26,2,,1,1,,,64.5,1,143.3,1,31.409956,,4,,,,,0,,0,,,
154,,Guatemala,Chimaltenango,Chimaltenango,1,,2,25,3,,1,1,,,66,1,157.3,1,26.673897,,3,,,,,0,,0,,,
155,,Guatemala,Chimaltenango,Chimaltenango,1,,2,21,2,,1,1,,,58.900002,1,145.5,1,27.822062,,3,,,,,0,,0,,,
156,,Guatemala,Chimaltenango,Chimaltenango,1,,2,28,2,,1,1,,,60.599998,1,141.89999,1,30.095936,,4,,,,,0,,0,,,
157,,Guatemala,Chimaltenango,Chimaltenango,1,,2,20,1,,1,1,,,59.299999,1,153.5,1,25.167376,,3,,,,,0,,0,,,
158,,Guatemala,Chimaltenango,Chimaltenango,1,,2,26,2,,1,1,,,69,1,149.5,1,30.872137,,4,,,,,0,,0,,,
159,,Guatemala,Chimaltenango,Chimaltenango,1,,2,25,3,,1,1,,,60.200001,1,152.5,1,25.885515,,3,,,,,0,,0,,,
160,,Guatemala,Chimaltenango,Chimaltenango,1,,2,28,3,,1,1,,,58.200001,1,148.89999,1,26.250261,,3,,,,,0,,0,,,
161,,Guatemala,Chimaltenango,Chimaltenango,1,,2,28,2,,1,1,,,49.700001,1,142.10001,1,24.613207,,2,,,,,0,,0,,,
162,,Guatemala,Chimaltenango,Chimaltenango,1,,2,33,2,,1,1,,,48.099998,1,141,1,24.193953,,2,,,,,0,,0,,,
163,,Guatemala,Chimaltenango,Chimaltenango,1,,2,22,3,,1,1,,,56,1,147,1,25.915129,,3,,,,,0,,0,,,
164,,Guatemala,Chimaltenango,Chimaltenango,1,,2,29,3,,1,1,,,42.299999,1,149.39999,1,18.951309,,2,,,,,0,,0,,,
165,,Guatemala,Chimaltenango,Chimaltenango,1,,2,18,2,,1,1,,,48.599998,1,143.5,1,,,,,,,,0,,0,,,23.60111
166,,Guatemala,Chimaltenango,Chimaltenango,1,,2,24,2,,1,1,,,61.599998,1,157,1,24.990871,,2,,,,,0,,0,,,
167,,Guatemala,Chimaltenango,Chimaltenango,1,,2,23,2,,1,1,,,55.400002,1,142.5,1,27.282242,,3,,,,,0,,0,,,
168,,Guatemala,Chimaltenango,Chimaltenango,1,,2,30,2,,1,1,,,50.200001,1,138.5,1,26.170027,,3,,,,,0,,0,,,
169,,Guatemala,Chimaltenango,Chimaltenango,1,,2,22,2,,1,1,,,57.400002,1,146,1,26.928129,,3,,,,,0,,0,,,
170,,Guatemala,Chimaltenango,Chimaltenango,1,,2,22,3,,1,1,,,51.099998,1,150.60001,1,22.530504,,2,,,,,0,,0,,,
171,,Guatemala,Chimaltenango,Chimaltenango,1,,2,27,2,,1,1,,,71.800003,1,149.7,1,32.039143,,4,,,,,0,,0,,,
172,,Guatemala,Chimaltenango,Chimaltenango,1,,2,28,2,,1,1,,,52.5,1,148.5,1,23.807095,,2,,,,,0,,0,,,
173,,Guatemala,Chimaltenango,Chimaltenango,1,,2,25,1,,1,1,,,60.799999,1,147.5,1,27.945992,,3,,,,,0,,0,,,
174,,Guatemala,Chimaltenango,Chimaltenango,1,,2,25,2,,1,1,,,43.299999,1,146.3,1,20.230156,,2,,,,,0,,0,,,
175,,Guatemala,Chimaltenango,Chimaltenango,1,,2,22,3,,1,1,,,68.5,1,147,1,31.699755,,4,,,,,0,,0,,,
176,,Guatemala,Chimaltenango,Chimaltenango,1,,2,23,2,,1,1,,,68.800003,1,154.10001,1,28.972311,,3,,,,,0,,0,,,
177,,Guatemala,Chimaltenango,Chimaltenango,1,,2,28,2,,1,1,,,46.900002,1,140.7,1,23.691071,,2,,,,,0,,0,,,
178,,Guatemala,Chimaltenango,Chimaltenango,1,,2,27,1,,1,1,,,48.900002,1,136.8,1,26.129835,,3,,,,,0,,0,,,
179,,Guatemala,Chimaltenango,Chimaltenango,1,,2,23,3,,1,1,,,60.099998,1,139.5,1,30.883467,,4,,,,,0,,0,,,
180,,Guatemala,Chimaltenango,Chimaltenango,1,,2,27,2,,1,1,,,57.400002,1,146.3,1,26.817806,,3,,,,,0,,0,,,
181,,Guatemala,Chimaltenango,Chimaltenango,1,,2,29,2,,1,1,,,42.200001,1,133.8,1,23.572205,,2,,,,,0,,0,,,
182,,Guatemala,Chimaltenango,Chimaltenango,1,,2,33,2,,1,1,,,38,1,145.3,1,17.999165,,1,,,,,0,,0,,,
183,,Guatemala,Chimaltenango,Chimaltenango,1,,2,26,2,,1,1,,,45.299999,1,144.7,1,21.635212,,2,,,,,0,,0,,,
184,,Guatemala,Chimaltenango,Chimaltenango,1,,2,17,2,,1,1,,,47.900002,1,142.89999,1,,,,,,,,0,,0,,,23.456926
185,,Guatemala,Chimaltenango,Chimaltenango,1,,2,28,2,,1,1,,,43.200001,1,142.39999,1,21.304131,,2,,,,,0,,0,,,
186,,Guatemala,Chimaltenango,Chimaltenango,1,,2,24,1,,1,1,,,61.5,1,147.39999,1,28.30611,,3,,,,,0,,0,,,
187,,Guatemala,Chimaltenango,Chimaltenango,1,,2,24,2,,1,1,,,51,1,151.60001,1,22.190737,,2,,,,,0,,0,,,
188,,Guatemala,Chimaltenango,Chimaltenango,1,,2,31,3,,1,1,,,54.400002,1,142.8,1,26.677338,,3,,,,,0,,0,,,
189,,Guatemala,Chimaltenango,Chimaltenango,1,,2,18,2,,1,1,,,48,1,154.39999,1,,,,,,,,0,,0,,,20.134769
190,,Guatemala,Chimaltenango,Chimaltenango,1,,2,20,2,,1,1,,,42.799999,1,147.8,1,19.592726,,2,,,,,0,,0,,,
191,,Guatemala,Chimaltenango,Chimaltenango,1,,2,27,3,,1,1,,,46.900002,1,148.5,1,21.267672,,2,,,,,0,,0,,,
193,,Guatemala,Chimaltenango,Chimaltenango,1,,2,21,2,,1,1,,,45.700001,1,151.60001,1,19.884642,,2,,,,,0,,0,,,
194,,Guatemala,Chimaltenango,Chimaltenango,1,,2,19,2,,1,1,,,44.700001,1,143.10001,1,,,,,,,,0,,0,,,21.828718
195,,Guatemala,Chimaltenango,Chimaltenango,1,,2,22,2,,1,1,,,50.400002,1,150.10001,1,22.370163,,2,,,,,0,,0,,,
196,,Guatemala,Chimaltenango,Chimaltenango,1,,2,27,2,,1,1,,,50.200001,1,156.3,1,20.548767,,2,,,,,0,,0,,,
197,,Guatemala,Chimaltenango,Chimaltenango,1,,2,28,2,,1,1,,,61.900002,1,136.2,1,33.368484,,4,,,,,0,,0,,,
198,,Guatemala,Chimaltenango,Chimaltenango,1,,2,22,2,,1,1,,,49,1,142.89999,1,23.995602,,2,,,,,0,,0,,,
199,,Guatemala,Chimaltenango,Chimaltenango,1,,2,21,2,,1,1,,,,,140.10001,1,,,,,,,,0,,0,,Missing value for weight,
200,,Guatemala,Chimaltenango,Chimaltenango,1,,2,23,3,,1,1,,,63.200001,1,148.89999,1,28.505438,,3,,,,,0,,0,,,
201,,Guatemala,Chimaltenango,Chimaltenango,1,,2,19,3,,1,1,,,53.099998,1,143.39999,1,,,,,,,,0,,0,,,25.822378
202,,Guatemala,Chimaltenango,Chimaltenango,1,,2,18,3,,1,1,,,56.599998,1,144.60001,1,,,,,,,,0,,0,,,27.069473
203,,Guatemala,Chimaltenango,Chimaltenango,1,,2,28,2,,1,1,,,67.699997,1,142,1,33.574684,,4,,,,,0,,0,,,
204,,Guatemala,Chimaltenango,Chimaltenango,1,,2,19,3,,1,1,,,45.400002,1,143.89999,1,,,,,,,,0,,0,,,21.924732
205,,Guatemala,Chimaltenango,Chimaltenango,1,,2,24,2,,1,1,,,40,1,143.7,1,19.370752,,2,,,,,0,,0,,,
206,,Guatemala,Chimaltenango,Chimaltenango,1,,2,27,3,,1,1,,,63.900002,1,156,1,26.257397,,3,,,,,0,,0,,,
207,,Guatemala,Chimaltenango,Chimaltenango,1,,2,24,3,,1,1,,,61.5,1,156,1,25.271204,,3,,,,,0,,0,,,
208,,Guatemala,Chimaltenango,Chimaltenango,1,,2,20,2,,1,1,,,71.699997,1,154,1,30.232754,,4,,,,,0,,0,,,
209,,Guatemala,Chimaltenango,Chimaltenango,1,,2,31,2,,1,1,,,88.199997,1,145.89999,1,41.434113,,4,,,,,0,,0,,,
210,,Guatemala,Chimaltenango,Chimaltenango,1,,2,28,3,,1,1,,,,,138.3,1,,,,,,,,0,,0,,Missing value for weight,
211,,Guatemala,Chimaltenango,Chimaltenango,1,,2,23,3,,1,1,,,68.900002,1,153,1,29.433125,,3,,,,,0,,0,,,
212,,Guatemala,Chimaltenango,Chimaltenango,1,,2,30,3,,1,1,,,49.200001,1,144.5,1,23.562937,,2,,,,,0,,0,,,
213,,Guatemala,Chimaltenango,Chimaltenango,1,,2,18,2,,1,1,,,44,1,146.2,1,,,,,,,,0,,0,,,20.585335
214,,Guatemala,Chimaltenango,Chimaltenango,1,,2,26,2,,1,1,,,48.200001,1,151.39999,1,21.027872,,2,,,,,0,,0,,,
215,,Guatemala,Chimaltenango,Chimaltenango,1,,2,30,2,,1,1,,,49,1,138.3,1,25.618382,,3,,,,,0,,0,,,
216,,Guatemala,Chimaltenango,Chimaltenango,1,,2,23,3,,1,1,,,50.599998,1,145.10001,1,24.033424,,2,,,,,0,,0,,,
217,,Guatemala,Chimaltenango,Chimaltenango,1,,2,21,3,,1,1,,,42.299999,1,146.3,1,19.762947,,2,,,,,0,,0,,,
218,,Guatemala,Chimaltenango,Chimaltenango,1,,2,21,3,,1,1,,,49.400002,1,145,1,23.495838,,2,,,,,0,,0,,,
219,,Guatemala,Chimaltenango,Chimaltenango,1,,2,27,3,,1,1,,,55.200001,1,151.39999,1,24.081713,,2,,,,,0,,0,,,
220,,Guatemala,Chimaltenango,Chimaltenango,1,,2,20,3,,1,1,,,40.799999,1,140,1,20.816326,,2,,,,,0,,0,,,
221,,Guatemala,Chimaltenango,Chimaltenango,1,,2,18,2,,1,1,,,67.199997,1,147.39999,1,,,,,,,,0,,0,,,30.929602
222,,Guatemala,Chimaltenango,Chimaltenango,1,,2,25,2,,1,1,,,48.400002,1,148.8,1,21.859463,,2,,,,,0,,0,,,
223,,Guatemala,Chimaltenango,Chimaltenango,1,,2,29,3,,1,1,,,63.799999,1,152,1,27.614265,,3,,,,,0,,0,,,
224,,Guatemala,Chimaltenango,Chimaltenango,1,,2,26,3,,1,1,,,55.900002,1,150.5,1,24.67964,,2,,,,,0,,0,,,
225,,Guatemala,Chimaltenango,Chimaltenango,1,,2,27,3,,1,1,,,57.700001,1,149.8,1,25.712965,,3,,,,,0,,0,,,
226,,Guatemala,Chimaltenango,Chimaltenango,1,,2,29,2,,1,1,,,52.400002,1,146.2,1,24.515265,,2,,,,,0,,0,,,
227,,Guatemala,Chimaltenango,Chimaltenango,1,,2,31,2,,1,1,,,,,143.7,1,,,,,,,,0,,0,,Missing value for weight,
228,,Guatemala,Chimaltenango,Chimaltenango,1,,2,31,2,,1,1,,,56.599998,1,151,1,24.823471,,2,,,,,0,,0,,,
229,,Guatemala,Chimaltenango,Chimaltenango,1,,2,19,3,,1,1,,,84.800003,1,151.60001,1,,,,,,,,0,,0,,,36.897541