id,sex,age,recall_n,recall_d,recall_m,recall_y,weekday,respondent,us_intake,consum_h,consum_min,meal_type,meal_place,eat_seq,food_type,rcp_code,rcp_descr,rcp_descr_eng,foodex2_rcp_code,foodex2_rcp_descr,rcp_amount,ingr_code,ingr_descr,ingr_descr_eng,foodex2_ingr_code,foodex2_ingr_descr,ingr_amount_unproc,ingr_amount_proc,energy,totalpro,animalpro,dairypro,plantpro,carb,adsugar,fiber,totalfat,sfa,mufa,pufa,water,n6,seafood_n3,plant_n3,tfa,chol,ca,fe,na,k,mg,zn,iod,se,ph,cu,vitb1,vitb2,vitb3,vitb6,fol,vitb12,vitc,vita,bcarot,vitd,vite,vitk,note
1,2,25,1,,8,2013,,1,0,,,,1,,1,,,,,,,67,Bekollo Kita,Pita From Maize,A006S#F04.A000T,"Pita bread, INGREDIENT = Maize grain",,465,1038.8101,19.1115,,,,218.55,,5.5799999,10.23,,,,,,,,,,37.3395,9.3000002,,,,5.5799999,,,803.28748,,.093000002,.2325,3.2550001,,41.989498,,0,0,0,,,,
1,2,25,1,,8,2013,,1,0,,,,1,,1,,,,,,,1,Buna Yefella,Coffee,A03KA,Coffee beverages,,55,93.059998,2.75,,,,17.049999,,6.6550002,1.54,,,,,,,,,,46.200001,2.2,,,,0,,,39.599998,,.0385,.0165,.0165,,0,,0,0,0,,,,
1,2,25,1,,8,2013,,1,0,,,,1,,2,1002,Gomen Kikil,Kale Boiled,,,813.5,82,Zeyt,"Palm Oil, Boiled",A037N#F28.A07GL,"Palm oil/fat, PROCESS = Boiling",,95.56,844.75043,0,,,,0,,0,95.559998,,,,,,,,,,0,.0095560001,,,,0,,,0,,0,0,0,,0,,0,0,0,,,,
1,2,25,1,,8,2013,,1,0,,,,1,,2,1002,Gomen Kikil,Kale Boiled,,,813.5,14,Gomen,Kale Boiled,A00GL#F28.A07GL,"Kales and similar-, PROCESS = Boiling",,623.1900000000001,249.89919,15.517431,,,,39.759521,,10.59423,3.1159501,,,,,,,,,,31.097181,13.647861,,,,1.24638,,,428.81705,,.249276,3.8637781,.373914,,186.45845,,233.07306,6.2319002,69.921921,,,,
1,2,25,1,,8,2013,,1,0,,,,1,,2,1002,Gomen Kikil,Kale Boiled,,,813.5,13,Onion,Onion Boiled,A00HC#F28.A07GL,"Onions, PROCESS = Boiling",,58.81,54.458061,1.35263,,,,11.99724,,.76453,.11762,,,,,,,,,,41.7551,.76453,,,,.123501,,,39.402699,,.023523999,.011762,0,,6.2103362,,3.5286,0,.047047999,,,,
1,2,25,1,,8,2013,,1,0,,,,1,,2,1002,Gomen Kikil,Kale Boiled,,,813.5,12,Karia,Green Pepper Boiled,A00JB#F28.A07GL$F10.A0F2Q,"Chili peppers, PROCESS = Boiling, QUALITATIVE-INFO = Green",,35.94,13.15404,.46722001,,,,2.65956,,1.50948,.071879998,,,,,,,,,,3.9533999,.39534,,,,1.541826,,,8.6255999,,.014376,.039533999,0,,10.052418,,8.9849997,20.773319,.086255997,,,,
2,2,35,1,,8,2013,,1,0,,,,1,,1,,,,,,,41,Milk,Cow Milk Whole,A02LY,"Cow milk, whole",,180,132.66,6.1199999,,,,5.5799999,,0,9.54,,,,,,,,,,160.2,1.8,,,,1.4400001,,,169.2,,.071999997,.37799999,.36000001,,14.436,,0,55.259998,0,,,,
2,2,35,1,,8,2013,,1,0,,,,1,,1,,,,,,,76a,Enjera Ye Nech Teff Ina Bekollo,25% White Teff And 75% Maize,A005Q#F04.A000A$F04.A001L,"Multigrain (not only rye-wheat) bread and rolls, INGREDIENT = Teff grain, INGREDIENT = Maize grain",,836.5,1263.4496,28.859249,,,,268.18188,,7.11025,7.5285001,,,,,,,,,,255.21616,25.931499,,,,8.6996002,,,723.73981,,1.0038,.50190002,4.1824999,,48.1824,,2.0912499,0,0,,,,
2,2,35,1,,8,2013,,1,0,,,,1,,1,,,,,,,1,Buna Yefella,Coffee,A03KA,Coffee beverages,,22,37.223999,1.1,,,,6.8200002,,2.6619999,.616,,,,,,,,,,18.48,.88,,,,0,,,15.84,,.0154,.0066,.0066,,0,,0,0,0,,,,
2,2,35,1,,8,2013,,1,0,,,,1,,2,1006,Misir Wet,Lentils Stew,,,937.2000000000001,25,Misir Kikil,Lenitls Boiled,A013Q#F28.A07GL,"Lentils (dry), PROCESS = Boiling",,731.0160000000001,828.31421,51.975239,,,,150.07759,,9.5032082,2.193048,,,,,,,,,,117.18186,16.082352,,,,9.2839031,,,18.056095,,1.2427272,1.1696256,3.6550801,,1325.6244,,10.96524,2.9240639,.36550799,,,,
2,2,35,1,,8,2013,,1,0,,,,1,,2,1006,Misir Wet,Lentils Stew,,,937.2000000000001,13,Onion,Onion Boiled,A00HC#F28.A07GL,"Onions, PROCESS = Boiling",,112.464,104.14166,2.5866721,,,,22.942656,,1.462032,.22492801,,,,,,,,,,79.849442,1.462032,,,,.2361744,,,75.350883,,.0449856,.0224928,0,,11.876199,,6.7478399,0,.0899712,,,,
2,2,35,1,,8,2013,,1,0,,,,1,,2,1006,Misir Wet,Lentils Stew,,,937.2000000000001,12,Karia,Green Pepper Boiled,A00JB#F28.A07GL$F10.A0F2Q,"Chili peppers, PROCESS = Boiling, QUALITATIVE-INFO = Green",,28.116,10.290456,.36550799,,,,2.080584,,1.180872,.056232002,,,,,,,,,,3.0927601,.30927601,,,,1.2061764,,,6.7478399,,.0112464,.0309276,0,,7.8640451,,7.0289998,16.251047,.067478403,,,,
2,2,35,1,,8,2013,,1,0,,,,1,,2,1006,Misir Wet,Lentils Stew,,,937.2000000000001,81,Zeyt,"Palm Oil, Fried",A037N#F28.A07GR,"Palm oil/fat, PROCESS = Frying",,65.60400000000001,579.93933,0,,,,0,,0,65.603996,,,,,,,,,,0,.0065604001,,,,0,,,0,,0,0,0,,0,,0,0,0,,,,
3,2,28,1,,8,2013,,1,0,,,,1,,1,,,,,,,1,Buna Yefella,Coffee,A03KA,Coffee beverages,,16.5,27.917999,.82499999,,,,5.1149998,,1.9965,.46200001,,,,,,,,,,13.86,.66000003,,,,0,,,11.88,,.01155,.00495,.00495,,0,,0,0,0,,,,
3,2,28,1,,8,2013,,1,0,,,,1,,1,,,,,,,67,Bekollo Kita,Pita From Maize,A006S#F04.A000T,"Pita bread, INGREDIENT = Maize grain",,620,1385.08,25.482,,,,291.39999,,7.4400001,13.64,,,,,,,,,,49.785999,12.4,,,,7.4400001,,,1071.05,,.124,.31,4.3400002,,55.986,,0,0,0,,,,
3,2,28,1,,8,2013,,1,0,,,,1,,2,1002,Gomen Kikil,Kale Boiled,,,750.3000000000001,13,Onion,Onion Boiled,A00HC#F28.A07GL,"Onions, PROCESS = Boiling",,54.24,50.226238,1.24752,,,,11.06496,,.70512003,.10848,,,,,,,,,,38.510399,.70512003,,,,.113904,,,36.340801,,.021695999,.010848,0,,5.7277441,,3.2544,0,.043391999,,,,
3,2,28,1,,8,2013,,1,0,,,,1,,2,1002,Gomen Kikil,Kale Boiled,,,750.3000000000001,82,Zeyt,"Palm Oil, Boiled",A037N#F28.A07GL,"Palm oil/fat, PROCESS = Boiling",,88.13,779.06921,0,,,,0,,0,88.129997,,,,,,,,,,0,.0088130003,,,,0,,,0,,0,0,0,,0,,0,0,0,,,,
3,2,28,1,,8,2013,,1,0,,,,1,,2,1002,Gomen Kikil,Kale Boiled,,,750.3000000000001,12,Karia,Green Pepper Boiled,A00JB#F28.A07GL$F10.A0F2Q,"Chili peppers, PROCESS = Boiling, QUALITATIVE-INFO = Green",,33.15,12.1329,.43094999,,,,2.4531,,1.3923,.066299997,,,,,,,,,,3.6465001,.36465001,,,,1.422135,,,7.9559999,,.01326,.036465,0,,9.2720547,,8.2875004,19.1607,.079559997,,,,
3,2,28,1,,8,2013,,1,0,,,,1,,2,1002,Gomen Kikil,Kale Boiled,,,750.3000000000001,14,Gomen,Kale Boiled,A00GL#F28.A07GL,"Kales and similar-, PROCESS = Boiling",,574.78,230.48679,14.312022,,,,36.670963,,9.7712603,2.8738999,,,,,,,,,,28.681522,12.587682,,,,1.14956,,,395.5061,,.229912,3.5636361,.344868,,171.97418,,214.96771,5.7477999,64.490318,,,,
4,2,30,1,,8,2013,,1,0,,,,1,,1,,,,,,,1,Buna Yefella,Coffee,A03KA,Coffee beverages,,16.5,27.917999,.82499999,,,,5.1149998,,1.9965,.46200001,,,,,,,,,,13.86,.66000003,,,,0,,,11.88,,.01155,.00495,.00495,,0,,0,0,0,,,,
4,2,30,1,,8,2013,,1,0,,,,1,,1,,,,,,,67,Bekollo Kita,Pita From Maize,A006S#F04.A000T,"Pita bread, INGREDIENT = Maize grain",,135,301.59,5.5485001,,,,63.450001,,1.62,2.97,,,,,,,,,,10.8405,2.7,,,,1.62,,,233.21249,,.027000001,.067500003,.94499999,,12.1905,,0,0,0,,,,
4,2,30,1,,8,2013,,1,0,,,,1,,1,,,,,,,57,Enjera Key Teff,Red Teff,A0BY0#F04.A000A$F10.A0F2S,"Leavened bread and similar, INGREDIENT = Teff grain, QUALITATIVE-INFO = Red",,705,1100.2935,23.969999,,,,239.9115,,12.69,4.9349999,,,,,,,,,,352.85251,103.7055,,,,7.7550001,,,811.59601,,.63450003,8.1780005,4.23,,126.9705,,0,0,.2115,,,,
4,2,30,1,,8,2013,,1,0,,,,1,,1,,,,,,,55a,Difo Dabo,Bread 25% Wheat And 75% Maize,A005Q#F04.A000T$F04.A001P,"Multigrain (not only rye-wheat) bread and rolls, INGREDIENT = Maize grain, INGREDIENT = Durum wheat grain",,270,602.23499,12.906,,,,126.819,,3.24,4.9949999,,,,,,,,,,34.479,5.8724999,,,,3.3210001,,,493.58701,,.189,.2025,2.7,,28.403999,,0,0,.054000001,,,,
4,2,30,1,,8,2013,,1,0,,,,1,,2,1002,Gomen Kikil,Kale Boiled,,,406.8,13,Onion,Onion Boiled,A00HC#F28.A07GL,"Onions, PROCESS = Boiling",,29.41,27.23366,.67642999,,,,5.99964,,.38233,.058820002,,,,,,,,,,20.8811,.38233,,,,.061760999,,,19.7047,,.011764,.0058820001,0,,3.105696,,1.7646,0,.023528,,,,
4,2,30,1,,8,2013,,1,0,,,,1,,2,1002,Gomen Kikil,Kale Boiled,,,406.8,12,Karia,Green Pepper Boiled,A00JB#F28.A07GL$F10.A0F2Q,"Chili peppers, PROCESS = Boiling, QUALITATIVE-INFO = Green",,17.97,6.5770202,.23361,,,,1.32978,,.75474,.035939999,,,,,,,,,,1.9766999,.19767,,,,.770913,,,4.3127999,,.0071879998,.019766999,0,,5.0262089,,4.4924998,10.38666,.043127999,,,,
4,2,30,1,,8,2013,,1,0,,,,1,,2,1002,Gomen Kikil,Kale Boiled,,,406.8,82,Zeyt,"Palm Oil, Boiled",A037N#F28.A07GL,"Palm oil/fat, PROCESS = Boiling",,47.79,422.46359,0,,,,0,,0,47.790001,,,,,,,,,,0,.0047789998,,,,0,,,0,,0,0,0,,0,,0,0,0,,,,
4,2,30,1,,8,2013,,1,0,,,,1,,2,1002,Gomen Kikil,Kale Boiled,,,406.8,14,Gomen,Kale Boiled,A00GL#F28.A07GL,"Kales and similar-, PROCESS = Boiling",,311.64,124.96764,7.7598362,,,,19.882631,,5.2978802,1.5582,,,,,,,,,,15.550836,6.8249159,,,,.62327999,,,214.43948,,.124656,1.932168,.186984,,93.242691,,116.55336,3.1164,34.966007,,,,
4,2,30,1,,8,2013,,1,0,,,,1,,2,1006,Misir Wet,Lentils Stew,,,424.5,25,Misir Kikil,Lenitls Boiled,A013Q#F28.A07GL,"Lentils (dry), PROCESS = Boiling",,331.11,375.18076,23.541922,,,,67.976883,,4.30443,.99333,,,,,,,,,,53.076935,7.28442,,,,4.2050972,,,8.1784172,,.56288701,.52977598,1.65555,,600.43488,,4.96665,1.32444,.165555,,,,
4,2,30,1,,8,2013,,1,0,,,,1,,2,1006,Misir Wet,Lentils Stew,,,424.5,13,Onion,Onion Boiled,A00HC#F28.A07GL,"Onions, PROCESS = Boiling",,50.94,47.170441,1.17162,,,,10.39176,,.66222,.10188,,,,,,,,,,36.1674,.66222,,,,.106974,,,34.129799,,.020376001,.010188,0,,5.3792639,,3.0564001,0,.040752001,,,,
4,2,30,1,,8,2013,,1,0,,,,1,,2,1006,Misir Wet,Lentils Stew,,,424.5,12,Karia,Green Pepper Boiled,A00JB#F28.A07GL$F10.A0F2Q,"Chili peppers, PROCESS = Boiling, QUALITATIVE-INFO = Green",,12.735,4.6610098,.165555,,,,.94239002,,.53487003,.02547,,,,,,,,,,1.4008501,.140085,,,,.54633152,,,3.0564001,,.0050940001,.0140085,0,,3.5619795,,3.1837499,7.3608298,.030564001,,,,
4,2,30,1,,8,2013,,1,0,,,,1,,2,1006,Misir Wet,Lentils Stew,,,424.5,81,Zeyt,"Palm Oil, Fried",A037N#F28.A07GR,"Palm oil/fat, PROCESS = Frying",,29.715,262.6806,0,,,,0,,0,29.715,,,,,,,,,,0,.0029714999,,,,0,,,0,,0,0,0,,0,,0,0,0,,,,
5,2,32,1,,8,2013,,1,0,,,,1,,1,,,,,,,1,Buna Yefella,Coffee,A03KA,Coffee beverages,,16.5,27.917999,.82499999,,,,5.1149998,,1.9965,.46200001,,,,,,,,,,13.86,.66000003,,,,0,,,11.88,,.01155,.00495,.00495,,0,,0,0,0,,,,
5,2,32,1,,8,2013,,1,0,,,,1,,1,,,,,,,67,Bekollo Kita,Pita From Maize,A006S#F04.A000T,"Pita bread, INGREDIENT = Maize grain",,180,402.12,7.3979998,,,,84.599998,,2.1600001,3.96,,,,,,,,,,14.454,3.5999999,,,,2.1600001,,,310.95001,,.035999998,.090000004,1.26,,16.254,,0,0,0,,,,
5,2,32,1,,8,2013,,1,0,,,,1,,2,1002,Gomen Kikil,Kale Boiled,,,406.8,12,Karia,Green Pepper Boiled,A00JB#F28.A07GL$F10.A0F2Q,"Chili peppers, PROCESS = Boiling, QUALITATIVE-INFO = Green",,17.97,6.5770202,.23361,,,,1.32978,,.75474,.035939999,,,,,,,,,,1.9766999,.19767,,,,.770913,,,4.3127999,,.0071879998,.019766999,0,,5.0262089,,4.4924998,10.38666,.043127999,,,,
5,2,32,1,,8,2013,,1,0,,,,1,,2,1002,Gomen Kikil,Kale Boiled,,,406.8,13,Onion,Onion Boiled,A00HC#F28.A07GL,"Onions, PROCESS = Boiling",,29.41,27.23366,.67642999,,,,5.99964,,.38233,.058820002,,,,,,,,,,20.8811,.38233,,,,.061760999,,,19.7047,,.011764,.0058820001,0,,3.105696,,1.7646,0,.023528,,,,
5,2,32,1,,8,2013,,1,0,,,,1,,2,1002,Gomen Kikil,Kale Boiled,,,406.8,82,Zeyt,"Palm Oil, Boiled",A037N#F28.A07GL,"Palm oil/fat, PROCESS = Boiling",,47.79,422.46359,0,,,,0,,0,47.790001,,,,,,,,,,0,.0047789998,,,,0,,,0,,0,0,0,,0,,0,0,0,,,,
5,2,32,1,,8,2013,,1,0,,,,1,,2,1002,Gomen Kikil,Kale Boiled,,,406.8,14,Gomen,Kale Boiled,A00GL#F28.A07GL,"Kales and similar-, PROCESS = Boiling",,311.64,124.96764,7.7598362,,,,19.882631,,5.2978802,1.5582,,,,,,,,,,15.550836,6.8249159,,,,.62327999,,,214.43948,,.124656,1.932168,.186984,,93.242691,,116.55336,3.1164,34.966007,,,,
6,2,32,1,,8,2013,,1,0,,,,1,,1,,,,,,,67,Bekollo Kita,Pita From Maize,A006S#F04.A000T,"Pita bread, INGREDIENT = Maize grain",,480,1072.3199,19.728001,,,,225.60001,,5.7600002,10.56,,,,,,,,,,38.543999,9.6000004,,,,5.7600002,,,829.20001,,.096000001,.23999999,3.3599999,,43.344002,,0,0,0,,,,
6,2,32,1,,8,2013,,1,0,,,,1,,1,,,,,,,52,Bekolo Kollo,Sweet Corn Roasted,A00KP#F28.A07GY,"Sweet corn, PROCESS = Roasting",,100,276.5,7.3000002,,,,53.5,,2.4000001,3.7,,,,,,,,,,13,2.8,,,,.80000001,,,218,,.20999999,.25999999,1,,11.4,,0,6.6999998,1.22,,,,
6,2,32,1,,8,2013,,1,0,,,,1,,2,1002,Gomen Kikil,Kale Boiled,,,706.4000000000001,12,Karia,Green Pepper Boiled,A00JB#F28.A07GL$F10.A0F2Q,"Chili peppers, PROCESS = Boiling, QUALITATIVE-INFO = Green",,31.21,11.42286,.40573001,,,,2.30954,,1.31082,.062419999,,,,,,,,,,3.4331,.34331,,,,1.338909,,,7.4903998,,.012484,.034331001,0,,8.7294369,,7.8024998,18.039379,.074904002,,,,
6,2,32,1,,8,2013,,1,0,,,,1,,2,1002,Gomen Kikil,Kale Boiled,,,706.4000000000001,13,Onion,Onion Boiled,A00HC#F28.A07GL,"Onions, PROCESS = Boiling",,51.07,47.290821,1.17461,,,,10.41828,,.66390997,.10214,,,,,,,,,,36.259701,.66390997,,,,.107247,,,34.2169,,.020428,.010214,0,,5.392992,,3.0641999,0,.040856,,,,
6,2,32,1,,8,2013,,1,0,,,,1,,2,1002,Gomen Kikil,Kale Boiled,,,706.4000000000001,82,Zeyt,"Palm Oil, Boiled",A037N#F28.A07GL,"Palm oil/fat, PROCESS = Boiling",,82.98,733.54321,0,,,,0,,0,82.980003,,,,,,,,,,0,.0082980003,,,,0,,,0,,0,0,0,,0,,0,0,0,,,,
6,2,32,1,,8,2013,,1,0,,,,1,,2,1002,Gomen Kikil,Kale Boiled,,,706.4000000000001,14,Gomen,Kale Boiled,A00GL#F28.A07GL,"Kales and similar-, PROCESS = Boiling",,541.15,217.00114,13.474635,,,,34.525372,,9.1995497,2.70575,,,,,,,,,,27.003386,11.851185,,,,1.0822999,,,372.36533,,.21646,3.35513,.32469001,,161.91208,,202.39011,5.4115,60.71703,,,,
7,2,24,1,,8,2013,,1,0,,,,1,,1,,,,,,,67,Bekollo Kita,Pita From Maize,A006S#F04.A000T,"Pita bread, INGREDIENT = Maize grain",,180,402.12,7.3979998,,,,84.599998,,2.1600001,3.96,,,,,,,,,,14.454,3.5999999,,,,2.1600001,,,310.95001,,.035999998,.090000004,1.26,,16.254,,0,0,0,,,,
7,2,24,1,,8,2013,,1,0,,,,1,,2,1002,Gomen Kikil,Kale Boiled,,,203.4,82,Zeyt,"Palm Oil, Boiled",A037N#F28.A07GL,"Palm oil/fat, PROCESS = Boiling",,23.89,211.18761,0,,,,0,,0,23.889999,,,,,,,,,,0,.002389,,,,0,,,0,,0,0,0,,0,,0,0,0,,,,
7,2,24,1,,8,2013,,1,0,,,,1,,2,1002,Gomen Kikil,Kale Boiled,,,203.4,14,Gomen,Kale Boiled,A00GL#F28.A07GL,"Kales and similar-, PROCESS = Boiling",,155.82,62.483822,3.8799181,,,,9.9413157,,2.6489401,.7791,,,,,,,,,,7.7754178,3.4124579,,,,.31163999,,,107.21974,,.062328,.966084,.093492001,,46.621346,,58.27668,1.5582,17.483004,,,,
7,2,24,1,,8,2013,,1,0,,,,1,,2,1002,Gomen Kikil,Kale Boiled,,,203.4,13,Onion,Onion Boiled,A00HC#F28.A07GL,"Onions, PROCESS = Boiling",,14.7,13.6122,.33809999,,,,2.9988,,.1911,.0294,,,,,,,,,,10.437,.1911,,,,.03087,,,9.849,,.0058800001,.00294,0,,1.55232,,.88200003,0,.01176,,,,
7,2,24,1,,8,2013,,1,0,,,,1,,2,1002,Gomen Kikil,Kale Boiled,,,203.4,12,Karia,Green Pepper Boiled,A00JB#F28.A07GL$F10.A0F2Q,"Chili peppers, PROCESS = Boiling, QUALITATIVE-INFO = Green",,8.99,3.2903399,.11687,,,,.66526002,,.37757999,.01798,,,,,,,,,,.98890001,.098889999,,,,.38567099,,,2.1575999,,.0035959999,.0098890001,0,,2.514503,,2.2474999,5.1962199,.021576,,,,
8,2,30,1,,8,2013,,1,0,,,,1,,1,,,,,,,77,Eshet Bekolo,Sweet Corn Boiled,A00KP#F28.A07GL,"Sweet corn, PROCESS = Boiling",,40,60.799999,1.2,,,,12,,.56,.80000001,,,,,,,,,,2.4000001,.36000001,,,,.47999999,,,42.799999,,.052000001,.024,.12,,3.5999999,,0,0,.27599999,,,,
8,2,30,1,,8,2013,,1,0,,,,1,,1,,,,,,,76c,Enjera Ye Nech Teff Ina Bekollo,75% White Teff And 25% Maize,A005Q#F04.A000A$F04.A001L,"Multigrain (not only rye-wheat) bread and rolls, INGREDIENT = Teff grain, INGREDIENT = Maize grain",,705.31,1037.5815,22.217264,,,,221.25575,,6.7004452,4.93717,,,,,,,,,,335.30438,40.202671,,,,7.6173482,,,674.13531,,1.269558,.63477898,3.5265501,,13.541952,,5.289825,0,0,,,,
8,2,30,1,,8,2013,,1,0,,,,1,,1,,,,,,,1,Buna Yefella,Coffee,A03KA,Coffee beverages,,33,55.835999,1.65,,,,10.23,,3.993,.92400002,,,,,,,,,,27.719999,1.3200001,,,,0,,,23.76,,.0231,.0098999999,.0098999999,,0,,0,0,0,,,,
8,2,30,1,,8,2013,,1,0,,,,1,,1,,,,,,,41,Milk,Cow Milk Whole,A02LY,"Cow milk, whole",,75,55.275002,2.55,,,,2.325,,0,3.9749999,,,,,,,,,,66.75,.75,,,,.60000002,,,70.5,,.029999999,.1575,.15000001,,6.0149999,,0,23.025,0,,,,
8,2,30,1,,8,2013,,1,0,,,,1,,2,1001,Ater Kik Wet,Pea Souce,,,468.6,13,Onion,Onion Boiled,A00HC#F28.A07GL,"Onions, PROCESS = Boiling",,52.48,48.596481,1.20704,,,,10.70592,,.68224001,.10496,,,,,,,,,,37.260799,.68224001,,,,.110208,,,35.161598,,.020992,.010496,0,,5.5418882,,3.1487999,0,.041983999,,,,
8,2,30,1,,8,2013,,1,0,,,,1,,2,1001,Ater Kik Wet,Pea Souce,,,468.6,21,Ater Kikil,Peas Boiled,A012J#F28.A07GL,"Garden peas (without pods), PROCESS = Boiling",,363.17,573.15491,27.237749,,,,111.13002,,14.16363,2.1790199,,,,,,,,,,170.6899,6.9002299,,,,3.5227489,,,512.0697,,.472121,.43580401,1.45268,,105.46457,,89.485085,108.66046,0,,,,
8,2,30,1,,8,2013,,1,0,,,,1,,2,1001,Ater Kik Wet,Pea Souce,,,468.6,12,Karia,Green Pepper Boiled,A00JB#F28.A07GL$F10.A0F2Q,"Chili peppers, PROCESS = Boiling, QUALITATIVE-INFO = Green",,4.69,1.71654,.060970001,,,,.34705999,,.19698,.0093799997,,,,,,,,,,.51590002,.051589999,,,,.20120101,,,1.1256,,.001876,.0051589999,0,,1.311793,,1.1725,2.71082,.011256,,,,
8,2,30,1,,8,2013,,1,0,,,,1,,2,1001,Ater Kik Wet,Pea Souce,,,468.6,81,Zeyt,"Palm Oil, Fried",A037N#F28.A07GR,"Palm oil/fat, PROCESS = Frying",,44.52,393.55679,0,,,,0,,0,44.52,,,,,,,,,,0,.0044519999,,,,0,,,0,,0,0,0,,0,,0,0,0,,,,
8,2,30,1,,8,2013,,1,0,,,,1,,2,1001,Ater Kik Wet,Pea Souce,,,468.6,11,Garlic,Garlic Boiled,A00GZ#F28.A07GL,"Garlic, PROCESS = Boiling",,3.75,4.7137499,.16875,,,,1.00125,,.037500001,.0037499999,,,,,,,,,,1.05,.041250002,,,,.045000002,,,3.075,,.0089999996,.0044999998,0,,.112125,,.037500001,0,0,,,,
9,2,18,1,,8,2013,,1,0,,,,1,,1,,,,,,,1,Buna Yefella,Coffee,A03KA,Coffee beverages,,5.5,9.3059998,.27500001,,,,1.705,,.66549999,.154,,,,,,,,,,4.6199999,.22,,,,0,,,3.96,,.00385,.00165,.00165,,0,,0,0,0,,,,
9,2,18,1,,8,2013,,1,0,,,,1,,1,,,,,,,41,Milk,Cow Milk Whole,A02LY,"Cow milk, whole",,18.75,13.81875,.63749999,,,,.58125001,,0,.99374998,,,,,,,,,,16.6875,.1875,,,,.15000001,,,17.625,,.0074999998,.039375,.037500001,,1.50375,,0,5.7562499,0,,,,
9,2,18,1,,8,2013,,1,0,,,,1,,1,,,,,,,56,Enjera Nech Teff,White Teff,A0BY0#F04.A000A$F10.A0FR,"Leavened bread and similar, INGREDIENT = Teff grain, QUALITATIVE-INFO = White",,117.5,170.1635,3.5132501,,,,36.377998,,1.16325,.69325,,,,,,,,,,65.717751,8.2132502,,,,1.2925,,,117.359,,.24675,.12925,.57574999,,18.612,,1.16325,0,0,,,,
9,2,18,1,,8,2013,,1,0,,,,1,,1,,,,,,,67,Bekollo Kita,Pita From Maize,A006S#F04.A000T,"Pita bread, INGREDIENT = Maize grain",,180,402.12,7.3979998,,,,84.599998,,2.1600001,3.96,,,,,,,,,,14.454,3.5999999,,,,2.1600001,,,310.95001,,.035999998,.090000004,1.26,,16.254,,0,0,0,,,,
9,2,18,1,,8,2013,,1,0,,,,1,,2,1002,Gomen Kikil,Kale Boiled,,,305.1,82,Zeyt,"Palm Oil, Boiled",A037N#F28.A07GL,"Palm oil/fat, PROCESS = Boiling",,35.84,316.82559,0,,,,0,,0,35.84,,,,,,,,,,0,.003584,,,,0,,,0,,0,0,0,,0,,0,0,0,,,,
9,2,18,1,,8,2013,,1,0,,,,1,,2,1002,Gomen Kikil,Kale Boiled,,,305.1,12,Karia,Green Pepper Boiled,A00JB#F28.A07GL$F10.A0F2Q,"Chili peppers, PROCESS = Boiling, QUALITATIVE-INFO = Green",,13.48,4.9336801,.17524,,,,.99752003,,.56616002,.02696,,,,,,,,,,1.4828,.14827999,,,,.57829201,,,3.2351999,,.0053920001,.014828,0,,3.7703559,,3.3699999,7.79144,.032352,,,,
9,2,18,1,,8,2013,,1,0,,,,1,,2,1002,Gomen Kikil,Kale Boiled,,,305.1,13,Onion,Onion Boiled,A00HC#F28.A07GL,"Onions, PROCESS = Boiling",,22.06,20.427561,.50738001,,,,4.5002398,,.28678,.044119999,,,,,,,,,,15.6626,.28678,,,,.046326,,,14.7802,,.0088240001,.0044120001,0,,2.329536,,1.3236001,0,.017648,,,,
9,2,18,1,,8,2013,,1,0,,,,1,,2,1002,Gomen Kikil,Kale Boiled,,,305.1,14,Gomen,Kale Boiled,A00GL#F28.A07GL,"Kales and similar-, PROCESS = Boiling",,233.73,93.725731,5.8198771,,,,14.911974,,3.9734099,1.16865,,,,,,,,,,11.663127,5.1186872,,,,.46746001,,,160.82962,,.093492001,1.449126,.140238,,69.932014,,87.415024,2.3373001,26.224506,,,,
9,2,18,1,,8,2013,,1,0,,,,1,,2,1007,Shiro Wet(Key),Pease Stew,,,130,12,Karia,Green Pepper Boiled,A00JB#F28.A07GL$F10.A0F2Q,"Chili peppers, PROCESS = Boiling, QUALITATIVE-INFO = Green",,2.6,.95160002,.033799998,,,,.19239999,,.1092,.0052,,,,,,,,,,.28600001,.0286,,,,.11154,,,.62400001,,.00104,.0028599999,0,,.72722,,.64999998,1.5028,.00624,,,,
9,2,18,1,,8,2013,,1,0,,,,1,,2,1007,Shiro Wet(Key),Pease Stew,,,130,24,Shiro Wet,Peas Flour Boiled,A185Q#F27.A013J$F28.A07GL$F26.A07XE,"Pulses flour, SOURCE-COMMODITIES = Garden peas (dry), PROCESS = Boiling, GENERIC-TERM = Other",,107.9,108.5474,3.0211999,,,,10.0347,,1.2948,6.2582002,,,,,,,,,,65.819,7.3372002,,,,2.9133,,,205.00999,,.021579999,.01079,.4316,,7.03508,,2.0501001,10.79,0,,,,
9,2,18,1,,8,2013,,1,0,,,,1,,2,1007,Shiro Wet(Key),Pease Stew,,,130,81,Zeyt,"Palm Oil, Fried",A037N#F28.A07GR,"Palm oil/fat, PROCESS = Frying",,9.100000000000001,80.444,0,,,,0,,0,9.1000004,,,,,,,,,,0,.00091,,,,0,,,0,,0,0,0,,0,,0,0,0,,,,
9,2,18,1,,8,2013,,1,0,,,,1,,2,1007,Shiro Wet(Key),Pease Stew,,,130,13,Onion,Onion Boiled,A00HC#F28.A07GL,"Onions, PROCESS = Boiling",,10.4,9.6303997,.2392,,,,2.1215999,,.13519999,.0208,,,,,,,,,,7.3839998,.13519999,,,,.021840001,,,6.9679999,,.00416,.00208,0,,1.09824,,.62400001,0,.00832,,,,
10,2,27,1,,8,2013,,1,0,,,,1,,1,,,,,,,67,Bekollo Kita,Pita From Maize,A006S#F04.A000T,"Pita bread, INGREDIENT = Maize grain",,315,703.71002,12.9465,,,,148.05,,3.78,6.9299998,,,,,,,,,,25.2945,6.3000002,,,,3.78,,,544.16248,,.063000001,.1575,2.2049999,,28.4445,,0,0,0,,,,
10,2,27,1,,8,2013,,1,0,,,,1,,1,,,,,,,77,Eshet Bekolo,Sweet Corn Boiled,A00KP#F28.A07GL,"Sweet corn, PROCESS = Boiling",,20,30.4,.60000002,,,,6,,.28,.40000001,,,,,,,,,,1.2,.18000001,,,,.23999999,,,21.4,,.026000001,.012,.059999999,,1.8,,0,0,.138,,,,
10,2,27,1,,8,2013,,1,0,,,,1,,1,,,,,,,1,Buna Yefella,Coffee,A03KA,Coffee beverages,,27.5,46.529999,1.375,,,,8.5249996,,3.3275001,.76999998,,,,,,,,,,23.1,1.1,,,,0,,,19.799999,,.01925,.00825,.00825,,0,,0,0,0,,,,
10,2,27,1,,8,2013,,1,0,,,,1,,2,1002,Gomen Kikil,Kale Boiled,,,406.8,12,Karia,Green Pepper Boiled,A00JB#F28.A07GL$F10.A0F2Q,"Chili peppers, PROCESS = Boiling, QUALITATIVE-INFO = Green",,17.97,6.5770202,.23361,,,,1.32978,,.75474,.035939999,,,,,,,,,,1.9766999,.19767,,,,.770913,,,4.3127999,,.0071879998,.019766999,0,,5.0262089,,4.4924998,10.38666,.043127999,,,,
10,2,27,1,,8,2013,,1,0,,,,1,,2,1002,Gomen Kikil,Kale Boiled,,,406.8,14,Gomen,Kale Boiled,A00GL#F28.A07GL,"Kales and similar-, PROCESS = Boiling",,311.64,124.96764,7.7598362,,,,19.882631,,5.2978802,1.5582,,,,,,,,,,15.550836,6.8249159,,,,.62327999,,,214.43948,,.124656,1.932168,.186984,,93.242691,,116.55336,3.1164,34.966007,,,,
10,2,27,1,,8,2013,,1,0,,,,1,,2,1002,Gomen Kikil,Kale Boiled,,,406.8,13,Onion,Onion Boiled,A00HC#F28.A07GL,"Onions, PROCESS = Boiling",,29.41,27.23366,.67642999,,,,5.99964,,.38233,.058820002,,,,,,,,,,20.8811,.38233,,,,.061760999,,,19.7047,,.011764,.0058820001,0,,3.105696,,1.7646,0,.023528,,,,
10,2,27,1,,8,2013,,1,0,,,,1,,2,1002,Gomen Kikil,Kale Boiled,,,406.8,82,Zeyt,"Palm Oil, Boiled",A037N#F28.A07GL,"Palm oil/fat, PROCESS = Boiling",,47.79,422.46359,0,,,,0,,0,47.790001,,,,,,,,,,0,.0047789998,,,,0,,,0,,0,0,0,,0,,0,0,0,,,,
11,2,35,1,,8,2013,,1,0,,,,1,,1,,,,,,,1,Buna Yefella,Coffee,A03KA,Coffee beverages,,5.5,9.3059998,.27500001,,,,1.705,,.66549999,.154,,,,,,,,,,4.6199999,.22,,,,0,,,3.96,,.00385,.00165,.00165,,0,,0,0,0,,,,
11,2,35,1,,8,2013,,1,0,,,,1,,1,,,,,,,52,Bekolo Kollo,Sweet Corn Roasted,A00KP#F28.A07GY,"Sweet corn, PROCESS = Roasting",,20,55.299999,1.46,,,,10.7,,.47999999,.74000001,,,,,,,,,,2.5999999,.56,,,,.16,,,43.599998,,.041999999,.052000001,.2,,2.28,,0,1.34,.244,,,,
11,2,35,1,,8,2013,,1,0,,,,1,,1,,,,,,,75a,Enjera Ye Key Teff Ina Bekollo,50% Red Teff And 50% Maize,A005Q#F04.A000A$F04.A001L,"Multigrain (not only rye-wheat) bread and rolls, INGREDIENT = Teff grain, INGREDIENT = Maize grain",,235,362.95749,8.2250004,,,,78.019997,,3.0550001,1.9974999,,,,,,,,,,84.599998,19.28175,,,,2.47925,,,230.66425,,.19975001,1.39825,1.28075,,30.04475,,0,0,.023499999,,,,
11,2,35,1,,8,2013,,1,0,,,,1,,2,1001,Ater Kik Wet,Pea Souce,,,232.3,81,Zeyt,"Palm Oil, Fried",A037N#F28.A07GR,"Palm oil/fat, PROCESS = Frying",,22.07,195.0988,0,,,,0,,0,22.07,,,,,,,,,,0,.002207,,,,0,,,0,,0,0,0,,0,,0,0,0,,,,