id,hh_id,country,sec_area,tert_area,round,smpl_weight,sex,age,edc_level,edc,residence,preg_lact,breastfeeding,hh_head,wgt,wgt_method,hgt,hgt_method,bmi_adults,bmi_children,bmi_cat,misrep,pa,pa_cat,smok,special_diet,special_diet_other,clin_diet,clin_diet_other,note,smpl_weight_ntr,bmi_chld
A601169401,A6011694,Republic of Korea,16,,1,9050.09874208663,1,76,3,,2,0,,,59.7,1,166.7,1,21.4834057783524,,2,,,,3,,,,,,3240.7607,
A601169402,A6011694,Republic of Korea,16,,1,,2,69,,,2,0,,,,,,,,,,,,,,,,,,,2679.5325,
A601177901,A6011779,Republic of Korea,16,,1,9797.098474342971,1,39,3,,2,0,,,62.7,1,171.7,1,21.2680146359218,,2,,,,1,,,,,,8511.2744,
A601177902,A6011779,Republic of Korea,16,,1,5660.14661906731,2,35,3,,2,0,,,58.3,1,169.5,1,20.2922007291966,,2,,,,3,,,,,,4516.8818,
A601177903,A6011779,Republic of Korea,16,,1,4292.27974858899,1,1.25,1,,2,0,0,,11.2,1,85,1,,,,,,,3,,,,,,3454.8442,15.50173
A601208501,A6012085,Republic of Korea,16,,1,4525.04937104332,1,71,1,,2,0,,,53.1,1,169,1,18.5917860018907,,2,,,,2,,,,,,2745.6626,
A601208502,A6012085,Republic of Korea,16,,1,4243.60431910059,2,68,2,,2,0,,,61.3,1,158.1,1,24.5243064682158,,2,,,,3,,,,,,2679.5325,
A601240801,A6012408,Republic of Korea,16,,1,8492.915129135519,2,28,3,,2,0,,,53.9,1,156.7,1,21.9508212009909,,2,,,,2,,,,,,6574.2168,
A601245901,A6012459,Republic of Korea,16,,1,6896.34382056977,2,45,3,,2,0,,,48.8,1,160.7,1,18.8967913790359,,2,,,,2,,,,,,6398.9497,
A601245903,A6012459,Republic of Korea,16,,1,5723.03966478532,1,4,1,,2,0,,,17.5,1,105.2,1,,,2,,,,3,,,,,,3454.8442,15.812719
A601245904,A6012459,Republic of Korea,16,,1,5658.13909213412,2,70,1,,2,0,,,53.7,1,145.3,1,25.4356626937456,,3,,,,3,,,,,,5140.4292,
A601249301,A6012493,Republic of Korea,16,,1,5660.14661906731,2,37,3,,2,0,,,55,1,159.8,1,21.5381868136171,,2,,,,1,,,,,,4516.8818,
A601286701,A6012867,Republic of Korea,16,,1,8487.20863820118,2,67,3,,2,0,,,73.90000000000001,1,165.7,1,26.9153121903055,,3,,,,3,,,,,,5359.0649,
A601296901,A6012969,Republic of Korea,16,,1,9689.617111603249,2,57,3,,2,0,,,61.8,1,158,1,24.755648133312,,2,,,,3,,,,,,4131.3755,
A601296902,A6012969,Republic of Korea,16,,1,,1,59,,,2,0,,,,,,,,,,,,,,,,,,,6690.4731,
A601332601,A6013326,Republic of Korea,16,,1,10809.9053131045,1,46,1,,2,0,,,68.3,1,175.8,1,22.0995261706278,,2,,,,1,,,,,,8678.0098,
A601332602,A6013326,Republic of Korea,16,,1,5566.042677771,2,52,2,,2,0,,,60.4,1,164.8,1,22.2393722311245,,2,,,,3,,,,,,5512.272,
A601332603,A6013326,Republic of Korea,16,,1,5387.78018907436,2,14,1,,2,0,,,57.3,1,158.9,1,,,2,,,,3,,,,,,4088.5525,22.693779
A601342801,A6013428,Republic of Korea,16,,1,7293.31607214053,2,33,3,,2,0,,,59.3,1,168.5,1,20.8859812096611,,2,,,,3,,,,,,7170.3877,
A601354701,A6013547,Republic of Korea,16,,1,10224.7654066214,1,41,3,,2,0,,,80.09999999999999,1,173.1,1,26.7324264332636,,3,,,,1,,,,,,8908.6494,
A601373401,A6013734,Republic of Korea,16,,1,4525.04937104332,1,66,1,,2,0,,,54.2,1,162.1,1,20.6268664555013,,2,,,,1,,,,,,4942.04,
A601385301,A6013853,Republic of Korea,16,,1,7165.89219467897,1,58,3,,2,0,,,44.5,1,165.1,1,16.3254764379351,,1,,,,1,,,,,,6690.4731,
A601404001,A6014040,Republic of Korea,16,,1,9797.098474342971,1,36,3,,2,0,,,74.90000000000001,1,171.7,1,25.4062886161171,,3,,,,1,,,,,,8511.2744,
A601407402,A6014074,Republic of Korea,16,,1,6365.40647865088,2,60,1,,2,0,,,53.7,1,159.1,1,21.2145550019931,,2,,,,3,,,,,,5401.6729,
A601407404,A6014074,Republic of Korea,16,,1,17277.2603966641,1,32,3,,2,0,,,65.2,1,169.9,1,22.5871188986632,,2,,,,3,,,,,,10250.26,
A602215301,A6022153,Republic of Korea,16,,1,20265.1292964884,1,76,3,,2,0,,,55.6,1,162.2,1,21.1335809560589,,2,,,,1,,,,,,8631.1035,
A602215302,A6022153,Republic of Korea,16,,1,,2,73,,,2,0,,,,,,,,,,,,,,,,,,,9126.9883,
A602222103,A6022221,Republic of Korea,16,,1,20483.1424482252,2,42,3,,2,0,,,48.9,1,159.2,1,19.2940203530214,,2,,,,3,,,,,,18924.469,
A602228901,A6022289,Republic of Korea,16,,1,9183.500855638171,2,48,3,,2,0,,,50.2,1,154.1,1,21.1396814982728,,2,,,,3,,,,,,7574.353,
A602228902,A6022289,Republic of Korea,16,,1,16211.9585311056,2,19,3,,2,0,,,65.59999999999999,1,157.5,1,,,3,,,,3,,,,,,10929.342,26.444948
A602228903,A6022289,Republic of Korea,16,,1,16211.9585311056,2,16,2,,2,0,,,58.2,1,161.7,1,,,2,,,,3,,,,,,10929.342,22.258862
A602228904,A6022289,Republic of Korea,16,,1,7534.64829275876,2,75,3,,2,0,,,70.3,1,153.7,1,29.7582638444714,,3,,,,3,,,,,,9797.8662,
A602268001,A6022680,Republic of Korea,16,,1,15069.2965855175,2,60,3,,2,0,,,57.5,1,156.4,1,23.5068451933203,,2,,,,2,,,,,,12787.778,
A602268005,A6022680,Republic of Korea,16,,1,15069.2965855175,2,64,2,,2,0,,,60.5,1,158.7,1,24.0215773322073,,2,,,,3,,,,,,12787.778,
A602290102,A6022901,Republic of Korea,16,,1,15069.2965855175,2,74,3,,2,0,,,,,,,,,,,,,3,,,,,,12169.317,
A602300301,A6023003,Republic of Korea,16,,1,20361.0445977351,2,66,1,,2,0,,,61.8,1,155.3,1,25.6239196387442,,3,,,,3,,,,,,14272.773,
A602310501,A6023105,Republic of Korea,16,,1,19084.8886927474,1,59,3,,2,0,,,67.90000000000001,1,167.4,1,24.2303042241378,,2,,,,2,,,,,,17818.707,
A602310502,A6023105,Republic of Korea,16,,1,12903.1569989013,2,57,3,,2,0,,,56.3,1,151.5,1,24.5291855918265,,2,,,,2,,,,,,11003.074,
A602319002,A6023190,Republic of Korea,16,,1,8602.104665934219,2,56,3,,2,0,,,56.1,1,154.4,1,23.532510939891,,2,,,,3,,,,,,7335.3823,
A602319003,A6023190,Republic of Korea,16,,1,15079.4286334049,2,28,3,,2,0,,,56.4,1,161.1,1,21.7314158826596,,2,,,,3,,,,,,11672.722,
A602319004,A6023190,Republic of Korea,16,,1,15079.4286334049,2,25,3,,2,0,,,50.2,1,161.8,1,19.1754993651458,,2,,,,3,,,,,,11672.722,
A602330901,A6023309,Republic of Korea,16,,1,16068.7250527669,1,70,3,,2,0,,,56.2,1,176.8,1,17.9792592289265,,1,,,,2,,,,,,9750.0146,
A602341101,A6023411,Republic of Korea,16,,1,8034.36252638343,1,71,3,,2,0,,,85.8,1,174.2,1,28.2742430214027,,3,,,,2,,,,,,4875.0073,
A602341102,A6023411,Republic of Korea,16,,1,7534.64829275876,2,69,3,,2,0,,,64.90000000000001,1,157.3,1,26.2293332859131,,3,,,,3,,,,,,4757.5913,
A602370001,A6023700,Republic of Korea,16,,1,18488.290709818,2,43,3,,2,0,,,58.5,1,169.3,1,20.4099504264982,,2,,,,3,,,,,,6517.6245,
A602370002,A6023700,Republic of Korea,16,,1,,2,15,,,2,0,,,,,,,,,,,,,,,,,,,10929.342,
A602383601,A6023836,Republic of Korea,16,,1,18488.290709818,2,43,3,,2,0,,,57.2,1,158.8,1,22.6827148195852,,2,,,,3,,,,,,18924.469,
A602383604,A6023836,Republic of Korea,16,,1,16921.8986297525,2,3,1,,2,0,0,,13.3,1,,,,,,,,,3,,,,,,10795.017,
A602385301,A6023853,Republic of Korea,16,,1,20450.8668830313,1,34,3,,2,0,,,79.59999999999999,1,178.4,1,25.0105572201331,,3,,,,3,,,,,,12133.099,
A602385302,A6023853,Republic of Korea,16,,1,10049.7621486913,2,35,3,,2,0,,,49.7,1,158.7,1,19.7334279902595,,2,,,,3,,,,,,8019.8613,
A602385303,A6023853,Republic of Korea,16,,1,7621.07299546804,1,2,1,,2,0,0,,12.6,1,85.5,1,,,2,,,,3,,,,,,6134.1807,17.236073
A602388701,A6023887,Republic of Korea,16,,1,13866.2180323635,2,41,3,,2,0,,,40.9,1,155.7,1,16.8712042368585,,1,,,,3,,,,,,13035.249,
A602388703,A6023887,Republic of Korea,16,,1,14867.7188787242,1,10,1,,2,0,,,33.7,1,144.5,1,,,2,,,,3,,,,,,6862.3242,16.139654
A603176201,A6031762,Republic of Korea,16,,1,5760.80022215462,2,80,1,,2,0,,,33.2,1,136.8,1,17.740501350843,,1,,,,3,,,,,,7491.1987,
A603191501,A6031915,Republic of Korea,16,,1,7021.47090530577,2,47,,,2,0,,,66.2,1,164.3,1,24.5235231337951,,2,,,,3,,,,,,5791.1572,
A603191503,A6031915,Republic of Korea,16,,1,12395.2506711311,2,17,2,,2,0,,,57.8,1,164.5,1,,,2,,,,3,,,,,,8356.2969,21.359743
A603191504,A6031915,Republic of Korea,16,,1,7578.31950845015,1,13,1,,2,0,,,55.1,1,164.9,1,,,2,,,,3,,,,,,5246.7583,20.263306
A603210201,A6032102,Republic of Korea,16,,1,5760.80022215462,2,80,3,,2,0,,,38.6,1,137.1,1,20.5358363644973,,2,,,,3,,,,,,7491.1987,
A603213601,A6032136,Republic of Korea,16,,1,13153.900366693,2,59,2,,2,0,,,60.9,1,164.9,1,22.3962847910103,,2,,,,3,,,,,,5608.4468,
A603213602,A6032136,Republic of Korea,16,,1,,1,17,,,2,0,,,,,,,,,,,,,,,,,,,9172.5576,
A603222101,A6032221,Republic of Korea,16,,1,6142.86900044722,1,68,2,,2,0,,,52.4,1,167.4,1,18.6990860286424,,2,,,,1,,,,,,6708.9443,
A603222102,A6032221,Republic of Korea,16,,1,5760.80022215462,2,64,1,,2,0,,,54.6,1,146.2,1,25.544528885903,,3,,,,3,,,,,,4888.605,
A603232301,A6032323,Republic of Korea,16,,1,6142.86900044722,1,77,1,,2,0,,,67.5,1,167.2,1,24.1452233236419,,2,,,,2,,,,,,4399.4146,
A603232302,A6032323,Republic of Korea,16,,1,5760.80022215462,2,68,1,,2,0,,,61.2,1,147.4,1,28.1680287350714,,3,,,,3,,,,,,3637.533,
A603259501,A6032595,Republic of Korea,16,,1,6142.86900044722,1,66,3,,2,0,,,60.8,1,170,1,21.038062283737,,2,,,,2,,,,,,6708.9443,
A603259502,A6032595,Republic of Korea,16,,1,5760.80022215462,2,60,3,,2,0,,,72.5,1,163.4,1,27.1540055341736,,3,,,,3,,,,,,4888.605,
A603273101,A6032731,Republic of Korea,16,,1,14674.71994241,1,47,3,,2,0,,,63.6,1,160.6,1,24.6584647546793,,2,,,,3,,,,,,11780.617,
A603273102,A6032731,Republic of Korea,16,,1,7021.47090530577,2,45,3,,2,0,,,41.9,1,136.8,1,22.3893676686844,,2,,,,3,,,,,,5791.1572,
A603273103,A6032731,Republic of Korea,16,,1,7314.0479121574,2,14,1,,2,0,,,46.2,1,151,1,,,2,,,,3,,,,,,5550.3135,20.26227
A603273104,A6032731,Republic of Korea,16,,1,7314.0479121574,2,10,1,,2,0,,,30.5,1,128.3,1,,,2,,,,3,,,,,,5550.3135,18.528767
A603273105,A6032731,Republic of Korea,16,,1,5826.87834912515,1,3,1,,2,0,0,,12.5,1,86.59999999999999,1,,,2,,,,3,,,,,,4690.0386,16.667645
A603308801,A6033088,Republic of Korea,16,,1,18428.6070013417,1,61,,,2,0,,,66.2,1,160.2,1,25.7948475766091,,3,,,,,,,,,,12291.793,
A603308804,A6033088,Republic of Korea,16,,1,,1,26,,,2,0,,,,,,,,,,,,,,,,,,,12670.02,
A603317301,A6033173,Republic of Korea,16,,1,6142.86900044722,1,71,1,,2,0,,,60.4,1,166.8,1,21.7092513039928,,2,,,,2,,,,,,3727.3064,
A603317302,A6033173,Republic of Korea,16,,1,5760.80022215462,2,63,1,,2,0,,,51.2,1,151.7,1,22.2484007875586,,2,,,,3,,,,,,4888.605,
A603317303,A6033173,Republic of Korea,16,,1,6253.8547056669,1,8,1,,2,0,,,24.5,1,130.2,1,,,2,,,,3,,,,,,5434.4556,14.452538
A603320701,A6033207,Republic of Korea,16,,1,9423.784193593439,2,43,,,2,0,,,62.9,1,155,1,26.1810613943808,,3,,,,,,,,,,7474.8149,
A603320703,A6033207,Republic of Korea,16,,1,7769.17113216687,1,2,1,,2,0,0,,13.3,1,92.2,1,,,2,,,,3,,,,,,4690.0386,15.645513
A603320704,A6033207,Republic of Korea,16,,1,7681.06696287282,2,74,1,,2,0,,,54.3,1,150.8,1,23.8779559414335,,2,,,,3,,,,,,6978.2627,
A603325801,A6033258,Republic of Korea,16,,1,6142.86900044722,1,75,1,,2,0,,,56.8,1,172,1,19.1995673336939,,2,,,,2,,,,,,4399.4146,
A603336001,A6033360,Republic of Korea,16,,1,5760.80022215462,2,68,2,,2,0,,,46.8,1,148.8,1,21.136836628512,,2,,,,3,,,,,,3637.533,
A603349601,A6033496,Republic of Korea,16,,1,7556.04375042705,2,53,3,,2,0,,,64.90000000000001,1,164.4,1,24.0127041634847,,2,,,,2,,,,,,7483.0483,
A603349602,A6033496,Republic of Korea,16,,1,12395.2506711311,2,16,2,,2,0,,,57.7,1,156,1,,,2,,,,3,,,,,,8356.2969,23.70973
A604186401,A6041864,Republic of Korea,16,,1,10714.8247610235,2,74,1,,2,0,,,49,1,148.7,1,22.1602238453958,,2,,,,3,,,,,,8652.833,
A604194901,A6041949,Republic of Korea,16,,1,5712.72760133124,1,63,3,,2,0,,,80.7,1,169.8,1,27.9896947978707,,3,,,,2,,,,,,7620.7241,
A604194902,A6041949,Republic of Korea,16,,1,5357.41238051175,2,62,2,,2,0,,,50.2,1,155.1,1,20.8679660508954,,2,,,,3,,,,,,4546.2905,
A604213601,A6042136,Republic of Korea,16,,1,8763.90365280635,2,41,3,,2,0,,,77.40000000000001,1,173.5,1,25.7123636937438,,3,,,,2,,,,,,9268.542,
A604213603,A6042136,Republic of Korea,16,,1,7173.57112230606,2,9,1,,2,0,,,38.5,1,137.7,1,,,3,,,,3,,,,,,5126.1592,20.304525
A604213604,A6042136,Republic of Korea,16,,1,7754.58902328917,1,7,1,,2,0,,,32.6,1,130.2,1,,,3,,,,3,,,,,,5053.9194,19.230724
A604223801,A6042238,Republic of Korea,16,,1,6529.80726754294,2,48,2,,2,0,,,73.90000000000001,1,147.5,1,33.9672507900029,,4,,,,3,,,,,,5385.6436,
A604257801,A6042578,Republic of Korea,16,,1,10722.0290201584,2,25,3,,2,0,,,61.3,1,159.7,1,24.0353606029464,,2,,,,3,,,,,,8299.7344,
A604271401,A6042714,Republic of Korea,16,,1,18176.6492565829,1,30,3,,2,0,,,65.5,1,169.2,1,22.8791867165188,,2,,,,2,,,,,,12940.62,
A604271402,A6042714,Republic of Korea,16,,1,11509.4678019346,2,34,3,,2,0,,,54.4,1,160.8,1,21.0390831910101,,2,,,,3,,,,,,13578.571,
A604271404,A6042714,Republic of Korea,16,,1,6725.22292716193,2,6,1,,2,0,,,19.8,1,109.9,1,,,2,,,,3,,,,,,5126.1592,16.393429
A604271405,A6042714,Republic of Korea,16,,1,6773.57940813633,1,3,1,,2,0,0,,,,,,,,,,,,3,,,,,,4361.6284,
A604296901,A6042969,Republic of Korea,16,,1,5712.72760133124,1,67,3,,2,0,,,68.2,1,164.5,1,25.2030191886623,,3,,,,1,,,,,,6239.1646,
A604317301,A6043173,Republic of Korea,16,,1,11532.1248741171,1,50,3,,2,0,,,69.40000000000001,1,169.6,1,24.127247241011,,2,,,,1,,,,,,10433.318,
A604346201,A6043462,Republic of Korea,16,,1,5712.72760133124,1,66,1,,2,0,,,73,1,170.9,1,24.9941708800105,,2,,,,3,,,,,,6239.1646,
A604346202,A6043462,Republic of Korea,16,,1,5357.41238051175,2,64,1,,2,0,,,55.3,1,151.3,1,24.1572378448249,,2,,,,3,,,,,,4546.2905,
A604358101,A6043581,Republic of Korea,16,,1,5712.72760133124,1,62,3,,2,0,,,48.4,1,155.8,1,19.9393251279989,,2,,,,1,,,,,,7620.7241,
A604358102,A6043581,Republic of Korea,16,,1,6116.41316821972,2,58,2,,2,0,,,63.6,1,160.8,1,24.5971634365486,,2,,,,3,,,,,,5215.7271,
A604358103,A6043581,Republic of Korea,16,,1,14541.3194052663,1,34,3,,2,0,,,77.40000000000001,1,181.1,1,23.59956837792,,2,,,,3,,,,,,8627.0801,
A604370001,A6043700,Republic of Korea,16,,1,11425.4552026625,1,72,1,,2,0,,,66.5,1,168.2,1,23.505509125793,,2,,,,1,,,,,,6932.6191,
A604370002,A6043700,Republic of Korea,16,,1,10714.8247610235,2,66,1,,2,0,,,61.3,1,154.2,1,25.7805232142467,,3,,,,3,,,,,,6765.645,
A604378501,A6043785,Republic of Korea,16,,1,5712.72760133124,1,73,2,,2,0,,,58,1,165.6,1,21.1498518051763,,2,,,,2,,,,,,3466.3096,
A604378502,A6043785,Republic of Korea,16,,1,5357.41238051175,2,66,1,,2,0,,,62,1,155.7,1,25.5749306280007,,3,,,,3,,,,,,3382.8225,
A604378503,A6043785,Republic of Korea,16,,1,6529.80726754294,2,46,3,,2,0,,,63,1,163.2,1,23.6537629757786,,2,,,,3,,,,,,5385.6436,
A604378504,A6043785,Republic of Korea,16,,1,7047.66372593625,1,10,1,,2,0,,,38.9,1,149.1,1,,,2,,,,3,,,,,,4879.3652,17.498238
A604387001,A6043870,Republic of Korea,16,,1,8036.11857076763,2,63,1,,2,0,,,67.5,1,154.3,1,28.3512310104505,,3,,,,3,,,,,,4546.2905,
A604387002,A6043870,Republic of Korea,16,,1,8569.09140199685,1,66,2,,2,0,,,65,1,165.4,1,23.7597762340828,,2,,,,2,,,,,,6239.1646,
A604387004,A6043870,Republic of Korea,16,,1,,2,42,,,2,0,,,,,,,,,,,,,,,,,,,4634.271,
A604415901,A6044159,Republic of Korea,16,,1,5712.72760133124,1,77,1,,2,0,,,87.40000000000001,1,172.3,1,29.4402082507363,,3,,,,2,,,,,,4091.355,
A604415902,A6044159,Republic of Korea,16,,1,5357.41238051175,2,76,1,,2,0,,,69.3,1,155.2,1,28.7706584121586,,3,,,,3,,,,,,6966.6436,
A604415903,A6044159,Republic of Korea,16,,1,7047.66372593625,1,13,1,,2,0,,,68.09999999999999,1,167.3,1,,,3,,,,3,,,,,,4879.3652,24.330734
A604421001,A6044210,Republic of Korea,16,,1,5357.41238051175,2,62,3,,2,0,,,49,1,134.5,1,27.0864139522671,,3,,,,3,,,,,,4546.2905,
A604441401,A6044414,Republic of Korea,16,,1,9046.70574218907,1,57,3,,2,0,,,63,1,158.2,1,25.1725719655863,,3,,,,3,,,,,,8446.5049,
A604441402,A6044414,Republic of Korea,16,,1,7026.94778071751,2,54,3,,2,0,,,63.5,1,162.4,1,24.0769613433959,,2,,,,3,,,,,,6959.064,
A604441403,A6044414,Republic of Korea,16,,1,5712.72760133124,1,80,1,,2,0,,,53.6,1,158.4,1,21.3626160595858,,2,,,,2,,,,,,4091.355,
A605177901,A6051779,Republic of Korea,16,,1,6694.23853099732,1,55,3,,2,0,,,60,1,162.2,1,22.806022614452,,2,,,,2,,,,,,6250.1108,
A605177902,A6051779,Republic of Korea,16,,1,5199.68991249657,2,54,3,,2,0,,,61.6,1,158.1,1,24.6443275439167,,2,,,,3,,,,,,5149.458,
A605177903,A6051779,Republic of Korea,16,,1,13174.4287335386,1,21,3,,2,0,,,74.09999999999999,1,177.7,1,23.4662315860544,,2,,,,3,,,,,,6609.2783,
A605188102,A6051881,Republic of Korea,16,,1,4831.82372192368,2,49,3,,2,0,,,52.3,1,154.7,1,21.8535029744581,,2,,,,2,,,,,,3985.1836,
A605188103,A6051881,Republic of Korea,16,,1,13174.4287335386,1,24,3,,2,0,,,70.59999999999999,1,171.6,1,23.9756358637478,,2,,,,1,,,,,,6609.2783,
A605188104,A6051881,Republic of Korea,16,,1,8678.365102805779,2,21,3,,2,0,,,57.9,1,159.6,1,22.7306989277706,,2,,,,3,,,,,,6488.5005,
A605200002,A6052000,Republic of Korea,16,,1,20689.1403458209,1,30,3,,2,0,,,79.7,1,171.3,1,27.1608649082648,,3,,,,3,,,,,,12767.461,
A605211901,A6052119,Republic of Korea,16,,1,4227.21400648429,1,71,1,,2,0,,,56.4,1,166.2,1,20.4181817391947,,2,,,,2,,,,,,2564.9451,
A605211902,A6052119,Republic of Korea,16,,1,3964.29345732049,2,70,1,,2,0,,,54.8,1,153.5,1,23.257541194071,,2,,,,3,,,,,,3201.3936,
A605218703,A6052187,Republic of Korea,16,,1,20336.5846005865,2,30,3,,2,0,,,59,1,161.6,1,22.5927605136751,,2,,,,3,,,,,,18702.41,
A605230601,A6052306,Republic of Korea,16,,1,9551.778996373771,1,40,3,,2,0,,,78.5,1,165.4,1,28.6944989903923,,3,,,,2,,,,,,8322.2891,
A605252701,A6052527,Republic of Korea,16,,1,9152.26078165413,1,35,3,,2,0,,,67,1,178.3,1,21.0752199765404,,2,,,,2,,,,,,7951.0684,
A605252702,A6052527,Republic of Korea,16,,1,6813.27546416604,2,33,3,,2,0,,,46.5,1,153.3,1,19.7864846820695,,2,,,,3,,,,,,6698.438,
A605273101,A6052731,Republic of Korea,16,,1,9152.26078165413,1,37,3,,2,0,,,112.3,1,175.9,1,36.2951066891914,,4,,,,2,,,,,,7951.0684,
A605273102,A6052731,Republic of Korea,16,,1,6813.27546416604,2,32,3,,2,0,,,56,1,161.3,1,21.5238170644665,,2,,,,3,,,,,,6698.438,
A605285001,A6052850,Republic of Korea,16,,1,8454.42801296857,1,68,3,,2,0,,,65.8,1,164.5,1,24.3161094224924,,2,,,,2,,,,,,6925.1377,
A605285002,A6052850,Republic of Korea,16,,1,7928.58691464098,2,61,3,,2,0,,,72.3,1,155.4,1,29.9389295528292,,3,,,,3,,,,,,5046.1387,
A605295201,A6052952,Republic of Korea,16,,1,9551.778996373771,1,40,3,,2,0,,,76.40000000000001,1,170,1,26.4359861591696,,3,,,,2,,,,,,8322.2891,
A605295202,A6052952,Republic of Korea,16,,1,5287.60000277287,2,36,3,,2,1,,,71.59999999999999,1,153.3,1,30.4669312523909,,,,,,3,,,,,,4219.584,
A605295203,A6052952,Republic of Korea,16,,1,4009.76510645248,1,2,1,,2,0,0,,13.8,1,86.40000000000001,1,,,4,,,,3,,,,,,3227.449,18.486368
A605327502,A6053275,Republic of Korea,16,,1,7247.73558288552,2,49,3,,2,0,,,54.5,1,165.2,1,19.9699241949006,,2,,,,3,,,,,,3985.1836,
A605327503,A6053275,Republic of Korea,16,,1,16140.0840419153,1,30,3,,2,0,,,69.90000000000001,1,178.6,1,21.9136270783461,,2,,,,1,,,,,,6383.7305,
A605327504,A6053275,Republic of Korea,16,,1,,1,25,,,2,0,,,,,,,,,,,,,,,,,,,5812.5806,
A605339402,A6053394,Republic of Korea,16,,1,9663.64744384736,2,49,1,,2,0,,,60.4,1,151.5,1,26.3155028374125,,3,,,,3,,,,,,7970.3672,
A605349601,A6053496,Republic of Korea,16,,1,4863.73132826981,2,41,3,,2,0,,,60,1,154.2,1,25.2337910743034,,3,,,,3,,,,,,3429.1948,
A605358101,A6053581,Republic of Korea,16,,1,20981.3665355756,1,59,,,2,0,,,63.2,1,172,1,21.362898864251,,2,,,,3,,,,,,12500.222,
A605358104,A6053581,Republic of Korea,16,,1,,1,24,,,2,0,,,,,,,,,,,,,,,,,,,13218.557,
A605371701,A6053717,Republic of Korea,16,,1,7928.58691464098,2,62,3,,2,0,,,66.2,1,159.2,1,26.1199212141108,,3,,,,3,,,,,,6728.1851,
A605404001,A6054040,Republic of Korea,16,,1,8533.3597528847,1,50,3,,2,0,,,85.3,1,176.2,1,27.4749697549864,,3,,,,3,,,,,,7720.2822,
A605404002,A6054040,Republic of Korea,16,,1,4831.82372192368,2,49,3,,2,0,,,44.7,1,158.1,1,17.8831402794331,,1,,,,3,,,,,,3985.1836,
A605404003,A6054040,Republic of Korea,16,,1,13174.4287335386,1,22,3,,2,0,,,71.2,1,182.6,1,21.353961099801,,2,,,,3,,,,,,6609.2783,
A605404004,A6054040,Republic of Korea,16,,1,8529.78913388424,2,16,2,,2,0,,,64.59999999999999,1,159.5,1,,,3,,,,3,,,,,,5750.3838,25.392832
A605404005,A6054040,Republic of Korea,16,,1,8529.78913388424,2,15,2,,2,0,,,42.1,1,150.9,1,,,2,,,,3,,,,,,5750.3838,18.488583
A605414201,A6054142,Republic of Korea,16,,1,4227.21400648429,1,80,3,,2,0,,,61.1,1,161.1,1,23.5423672062146,,2,,,,2,,,,,,3027.4563,
A605414202,A6054142,Republic of Korea,16,,1,3964.29345732049,2,73,2,,2,0,,,50.2,1,147,1,23.2310611319358,,2,,,,3,,,,,,3201.3936,
A606183001,A6061830,Republic of Korea,16,,1,20265.1292964884,1,74,1,,2,0,,,65.40000000000001,1,165.7,1,23.819504969499,,2,,,,2,,,,,,13244.759,
A606193201,A6061932,Republic of Korea,16,,1,11522.4790434044,1,55,2,,2,0,,,75.7,1,171,1,25.8883075134229,,3,,,,1,,,,,,10758.023,
A606193202,A6061932,Republic of Korea,16,,1,8949.98255164008,2,53,1,,2,0,,,48.1,1,148,1,21.9594594594595,,2,,,,3,,,,,,8863.5215,
A606193204,A6061932,Republic of Korea,16,,1,13656.2808837037,2,27,3,,2,0,,,58.2,1,160.2,1,22.6776454525476,,2,,,,3,,,,,,10571.088,
A606200002,A6062000,Republic of Korea,16,,1,9101.29806993572,2,38,3,,2,0,,,52.6,1,161.7,1,20.1171152668635,,2,,,,3,,,,,,10894.459,
A606200003,A6062000,Republic of Korea,16,,1,6852.54875741719,2,8,1,,2,0,,,22,1,121.7,1,,,2,,,,3,,,,,,4896.7598,14.853935
A606200004,A6062000,Republic of Korea,16,,1,6852.54875741719,2,5,1,,2,0,,,17.9,1,112.7,1,,,2,,,,3,,,,,,4896.7598,14.093057
A606211901,A6062119,Republic of Korea,16,,1,14688.072208236,1,51,3,,2,0,,,77.3,1,170.7,1,26.5284851754501,,3,,,,2,,,,,,13288.56,
A606211902,A6062119,Republic of Korea,16,,1,8316.791718653491,2,47,3,,2,0,,,56.1,1,158.8,1,22.2465087653624,,2,,,,3,,,,,,6859.5098,
A606211904,A6062119,Republic of Korea,16,,1,8976.367741061469,1,13,1,,2,0,,,71.40000000000001,1,174.9,1,,,2,,,,3,,,,,,6214.6802,23.340954
A606218701,A6062187,Republic of Korea,16,,1,11016.054156177,1,50,3,,2,0,,,80.2,1,174.8,1,26.2477155978195,,3,,,,2,,,,,,9966.4199,
A606218702,A6062187,Republic of Korea,16,,1,6237.59378899012,2,45,3,,2,0,,,55.4,1,160.3,1,21.5597003279487,,2,,,,3,,,,,,5144.6323,
A606218703,A6062187,Republic of Korea,16,,1,5139.41156806289,2,9,1,,2,0,,,37.3,1,133.6,1,,,3,,,,3,,,,,,4896.7598,20.897575
A606218704,A6062187,Republic of Korea,16,,1,5555.67427329754,1,7,1,,2,0,,,21,1,120.4,1,,,2,,,,3,,,,,,4827.7529,14.486595
A606220401,A6062204,Republic of Korea,16,,1,17283.7185651065,1,56,3,,2,0,,,78.3,1,172.7,1,26.2528880691521,,3,,,,2,,,,,,10758.023,
A606220402,A6062204,Republic of Korea,16,,1,11685.3987340856,2,55,3,,2,0,,,50,1,155.4,1,20.7046539092871,,2,,,,3,,,,,,6643.0928,
A606220403,A6062204,Republic of Korea,16,,1,,2,28,,,2,0,,,,,,,,,,,,,,,,,,,10571.088,
A606235701,A6062357,Republic of Korea,16,,1,11522.4790434044,1,59,3,,2,0,,,55.3,1,162,1,21.0714830056394,,2,,,,1,,,,,,10758.023,
A606235702,A6062357,Republic of Korea,16,,1,8949.98255164008,2,53,3,,2,0,,,46.4,1,162.4,1,17.5932441942294,,1,,,,3,,,,,,8863.5215,
A606235703,A6062357,Republic of Korea,16,,1,21929.0668686979,1,24,3,,2,0,,,61.4,1,172.7,1,20.5865559060784,,2,,,,3,,,,,,11376.241,
A606244202,A6062442,Republic of Korea,16,,1,21383.5627818415,1,39,3,,2,0,,,72.7,1,174.9,1,23.7659288113995,,2,,,,1,,,,,,19044.873,
A606244203,A6062442,Republic of Korea,16,,1,,2,4,,,2,0,,,,,,,,,,,,,,,,,,,7332.1631,
A606244204,A6062442,Republic of Korea,16,,1,,1,2,,,2,0,0,,,,,,,,,,,,,,,,,,4166.4424,
A606256101,A6062561,Republic of Korea,16,,1,5457.07901385955,1,74,3,,2,0,,,66.40000000000001,1,165.5,1,24.2422029736859,,2,,,,3,,,,,,3311.1897,
A606256102,A6062561,Republic of Korea,16,,1,5117.66439965896,2,67,3,,2,0,,,54.9,1,161.5,1,21.048797553892,,2,,,,3,,,,,,3231.4387,
A606256103,A6062561,Republic of Korea,16,,1,11815.0181571888,1,37,3,,2,0,,,69.5,1,,,,,,,,,3,,,,,,10264.351,
A606266301,A6062663,Republic of Korea,16,,1,12330.772141221,1,41,3,,2,0,,,75.2,1,173.8,1,24.8953534411867,,2,,,,2,,,,,,10743.574,
A606266302,A6062663,Republic of Korea,16,,1,6825.97355245179,2,39,3,,2,0,,,55.1,1,166.5,1,19.8757315874433,,2,,,,2,,,,,,5447.2295,
A606266303,A6062663,Republic of Korea,16,,1,6732.2758057961,1,12,1,,2,0,,,64.09999999999999,1,168.9,1,,,2,,,,3,,,,,,4661.0103,22.469776
A606266304,A6062663,Republic of Korea,16,,1,6732.2758057961,1,10,1,,2,0,,,27,1,131.2,1,,,2,,,,3,,,,,,4661.0103,15.685418
A606266305,A6062663,Republic of Korea,16,,1,5139.41156806289,2,7,1,,2,0,,,28.1,1,127,1,,,2,,,,3,,,,,,4896.7598,17.422035