id,hh_id,country,sec_area,tert_area,round,smpl_weight,sex,age,edc_level,edc,residence,preg_lact,breastfeeding,hh_head,wgt,wgt_method,hgt,hgt_method,bmi_adults,bmi_children,bmi_cat,misrep,pa,pa_cat,smok,special_diet,special_diet_other,clin_diet,clin_diet_other,note,marital_status,religion,bmi_chld
22581,1,Philippines,,,,,1,19,,,1,,,,74,1,158.60001,1,,,,,,,,,,,,,1,1,29.418825
12581,1,Philippines,,,,,2,39,1,5,1,0,,,48.799999,1,147.5,1,22.430336,,2,,,,,,,,,,2,1,
23294,1,Philippines,,,,,1,19,,,1,,,,68,1,167.2,1,,,,,,,,,,,,,5,1,24.324078
13294,1,Philippines,,,,,2,41,1,6,1,0,,,59,1,145,1,28.061831,,3,,,,,,,,,,2,1,
23259,2,Philippines,,,,,1,19,,,1,,,,52.099998,1,158.89999,1,,,,,,,,,,,,,1,1,20.63431
13259,2,Philippines,,,,,2,47,1,2,1,0,,,38.599998,1,150,1,17.155556,,1,,,,,,,,,,2,1,
13097,3,Philippines,,,,,2,43,1,5,1,0,,,56.099998,1,144.2,1,26.979404,,3,,,,,,,,,,2,1,
20913,3,Philippines,,,,,1,18,,,2,,,,57.900002,1,163.3,1,,,,,,,,,,,,,1,1,21.712318
12694,3,Philippines,,,,,2,43,1,3,1,0,,,57,1,155.8,1,23.482262,,2,,,,,,,,,,2,1,
22694,3,Philippines,,,,,2,19,,,1,3,,,45,1,151.7,1,,,,,,,,,,,,,3,1,19.554258
13203,4,Philippines,,,,,2,45,1,5,1,0,,,43.5,1,146.10001,1,20.379278,,2,,,,,,,,,,2,1,
12582,4,Philippines,,,,,2,52,1,6,1,0,,,49.099998,1,164,1,18.255503,,1,,,,,,,,,,3,1,
22718,4,Philippines,,,,,1,19,,,1,,,,54.5,1,162.3,1,,,,,,,,,,,,,1,1,20.689951
12606,4,Philippines,,,,,2,43,1,5,1,2,,,56,1,155.5,1,23.159397,,2,,,,,,,,,,2,1,
22748,4,Philippines,,,,,1,19,,,1,,,,60.799999,1,163,1,,,,,,,,,,,,,1,1,22.883812
12748,4,Philippines,,,,,2,37,1,6,1,2,,,67.099998,1,159.5,1,26.375526,,3,,,,,,,,,,2,1,
22606,4,Philippines,,,,,2,19,,,2,,,,54.099998,1,155.2,1,,,,,,,,,,,,,1,1,22.460211
12718,4,Philippines,,,,,2,50,2,9,1,0,,,47,1,152.2,1,20.28937,,2,,,,,,,,,,2,1,
23098,5,Philippines,,,,,2,19,,,1,1,,,57,1,161.7,1,,,,,,,,,,,,,3,1,21.799917
13298,5,Philippines,,,,,2,41,2,9,1,0,,,86.800003,1,158.39999,1,34.594688,,4,,,,,,,,,,2,,
13098,5,Philippines,,,,,2,44,1,4,1,0,,,55,1,148.10001,1,25.07567,,3,,,,,,,,,,2,1,
22677,5,Philippines,,,,,2,19,,,1,1,,,59,1,150.8,1,,,,,,,,,,,,,3,1,25.944738
12849,5,Philippines,,,,,2,49,1,4,1,0,,,45.099998,1,147.5,1,20.729675,,2,,,,,,,,,,2,1,
23158,5,Philippines,,,,,2,19,,,1,,,,42.5,1,145,1,,,,,,,,,,,,,1,1,20.214031
22696,5,Philippines,,,,,2,19,,,1,,,,39.099998,1,145.2,1,,,,,,,,,,,,,1,1,18.545713
13158,5,Philippines,,,,,2,56,1,3,1,0,,,62.799999,1,151.8,1,27.253111,,3,,,,,,,,,,2,1,
12696,5,Philippines,,,,,2,48,1,4,1,0,,,68,1,147.60001,1,31.213047,,4,,,,,,,,,,2,1,
12749,5,Philippines,,,,,2,46,1,2,1,2,,,45,1,152,1,19.477146,,2,,,,,,,,,,2,1,
12677,5,Philippines,,,,,2,42,1,5,1,0,,,64,1,148.2,1,29.139601,,3,,,,,,,,,,2,1,
22749,5,Philippines,,,,,2,19,,,1,,,,43.5,1,150.89999,1,,,,,,,,,,,,,1,1,19.103407
22760,6,Philippines,,,,,2,19,,,1,,,,40,1,150.39999,1,,,,,,,,,,,,,1,1,17.683342
13323,6,Philippines,,,,,2,50,1,1,1,0,,,39,1,149.3,1,17.49625,,1,,,,,,,,,,2,1,
23205,6,Philippines,,,,,1,19,,,1,,,,57.900002,1,165.5,1,,,,,,,,,,,,,1,1,21.13891
13205,6,Philippines,,,,,2,47,1,6,1,0,,,65.900002,1,152,1,28.523201,,3,,,,,,,,,,2,1,
23099,6,Philippines,,,,,2,19,,,1,,,,55.900002,1,157,1,,,,,,,,,,,,,1,1,22.678406
12584,6,Philippines,,,,,2,44,1,4,1,0,,,58.900002,1,150.2,1,26.108112,,3,,,,,,,,,,4,1,
13099,6,Philippines,,,,,2,38,1,4,1,2,,,51.099998,1,160.10001,1,19.936008,,2,,,,,,,,,,2,1,
23323,6,Philippines,,,,,2,19,,,1,2,,,48,1,146.7,1,,,,,,,,,,,,,3,1,22.303911
22584,6,Philippines,,,,,1,19,,,1,,,,45.900002,1,163.2,1,,,,,,,,,,,,,1,1,17.233458
20895,6,Philippines,,,,,2,19,,,2,,,,36.900002,1,150.5,1,,,,,,,,,,,,,1,1,16.291212
12760,6,Philippines,,,,,2,52,1,2,1,0,,,49.700001,1,150.3,1,22.000797,,2,,,,,,,,,,2,1,
10895,6,Philippines,,,,,2,40,2,10,2,0,,,60.700001,1,154.5,1,25.429144,,3,,,,,,,,,,2,1,
22719,7,Philippines,,,,,2,19,,,1,,,,50,1,145.89999,1,,,,,,,,,,,,,1,1,23.488726
12544,7,Philippines,,,,,2,41,1,4,1,0,,,53.799999,1,157.39999,1,21.715651,,2,,,,,,,,,,2,1,
23300,7,Philippines,,,,,1,18,,,1,,,,46.299999,1,160,1,,,,,,,,,,,,,1,1,18.085938
22679,7,Philippines,,,,,2,18,,,1,,,,49,1,160.89999,1,,,,,,,,,,,,,1,1,18.927097
23206,7,Philippines,,,,,2,19,,,1,,,,45.299999,1,158.2,1,,,,,,,,,,,,,1,1,18.100279
13300,7,Philippines,,,,,2,52,1,5,1,0,,,57.5,1,155.39999,1,23.810354,,2,,,,,,,,,,2,1,
12585,7,Philippines,,,,,2,49,1,0,1,0,,,53.900002,1,160,1,21.054688,,2,,,,,,,,,,2,1,
23100,7,Philippines,,,,,2,19,,,1,,,,44.099998,1,159.8,1,,,,,,,,,,,,,1,1,17.269709
13206,7,Philippines,,,,,2,41,1,2,1,2,,,53.900002,1,156.5,1,22.006962,,2,,,,,,,,,,2,1,
12679,7,Philippines,,,,,2,52,1,6,1,0,,,47,1,152.2,1,20.28937,,2,,,,,,,,,,2,1,
12719,7,Philippines,,,,,2,42,1,0,1,0,,,47,1,146.7,1,21.839247,,2,,,,,,,,,,2,1,
22544,7,Philippines,,,,,2,19,,,1,,,,46.5,1,155.39999,1,,,,,,,,,,,,,1,1,19.255329
13159,7,Philippines,,,,,2,36,1,6,1,0,,,51.200001,1,147.5,1,23.533468,,2,,,,,,,,,,3,1,
22750,7,Philippines,,,,,2,19,,,1,,,,48,1,147.7,1,,,,,,,,,,,,,1,1,22.002916
12761,7,Philippines,,,,,2,47,1,6,1,0,,,59.200001,1,156.60001,1,24.140049,,2,,,,,,,,,,2,1,
12750,7,Philippines,,,,,2,61,1,4,1,0,,,70,1,147.7,1,32.087589,,4,,,,,,,,,,2,1,
12789,7,Philippines,,,,,2,48,2,11,1,0,,,60.099998,1,153.7,1,25.440565,,3,,,,,,,,,,2,1,
22789,7,Philippines,,,,,1,18,,,1,,,,56,1,165.10001,1,,,,,,,,,,,,,1,1,20.544418
22761,7,Philippines,,,,,1,19,,,1,,,,54.900002,1,167.39999,1,,,,,,,,,,,,,1,1,19.591221
23159,7,Philippines,,,,,2,19,,,1,,,,47,1,144.60001,1,,,,,,,,,,,,,1,1,22.478184
13100,7,Philippines,,,,,2,52,1,5,1,0,,,65,1,152.7,1,27.87631,,3,,,,,,,,,,2,1,
23160,8,Philippines,,,,,1,19,2,11,1,,,,51,1,163.5,1,,,,,,,,,,,,,1,1,19.078079
12762,8,Philippines,,,,,2,54,1,4,1,0,,,64,1,155.8,1,26.366049,,3,,,,,,,,,,2,1,
12751,8,Philippines,,,,,2,48,1,6,1,2,,,49,1,156.7,1,19.955294,,2,,,,,,,,,,2,1,
22762,8,Philippines,,,,,2,19,,,1,,,,42,1,154.3,1,,,,,,,,,,,,,1,1,17.640766
22697,8,Philippines,,,,,1,19,,,1,,,,55,1,166.5,1,,,,,,,,,,,,,1,1,19.839659
13101,8,Philippines,,,,,2,48,1,6,1,0,,,44,1,150.10001,1,19.529507,,2,,,,,,,,,,2,1,
23101,8,Philippines,,,,,1,19,,,1,,,,46.299999,1,155.2,1,,,,,,,,,,,,,1,1,19.221956
12545,8,Philippines,,,,,2,53,1,0,1,0,,,34,1,152.5,1,14.619726,,1,,,,,,,,,,2,1,
22545,8,Philippines,,,,,2,19,,,1,,,,47.799999,1,146.89999,1,,,,,,,,,,,,,1,1,22.150541
12697,8,Philippines,,,,,2,46,1,4,1,0,,,44,1,148.10001,1,20.060535,,2,,,,,,,,,,2,1,
23161,9,Philippines,,,,,1,18,,,1,,,,46.599998,1,157.39999,1,,,,,,,,,,,,,1,1,18.809467
12587,9,Philippines,,,,,2,46,1,6,1,0,,,62.799999,1,150.10001,1,27.87393,,3,,,,,,,,,,2,1,
22608,9,Philippines,,,,,2,19,,,1,,,,54.099998,1,155.39999,1,,,,,,,,,,,,,1,1,22.402437
12608,9,Philippines,,,,,2,43,1,4,1,0,,,76.099998,1,158.3,1,30.368462,,4,,,,,,,,,,2,1,
13161,9,Philippines,,,,,2,44,1,6,1,0,,,60.599998,1,153.2,1,25.819933,,3,,,,,,,,,,2,1,
13102,9,Philippines,,,,,2,41,1,6,1,2,,,47.900002,1,159.10001,1,18.923223,,2,,,,,,,,,,2,1,
12752,9,Philippines,,,,,2,44,1,3,1,0,,,43,1,147.2,1,19.845079,,2,,,,,,,,,,2,1,
12763,9,Philippines,,,,,2,56,1,4,1,0,,,40,1,146.3,1,18.688366,,2,,,,,,,,,,4,1,
22763,9,Philippines,,,,,1,19,,,1,,,,56,1,166.8,1,,,,,,,,,,,,,1,1,20.127783
22587,9,Philippines,,,,,2,18,,,1,,,,43.799999,1,149.5,1,,,,,,,,,,,,,1,1,19.597095
23102,9,Philippines,,,,,1,19,,,1,,,,56.900002,1,168.39999,1,,,,,,,,,,,,,1,1,20.064491
12546,9,Philippines,,,,,2,44,1,6,1,0,,,47,1,147.60001,1,21.573723,,2,,,,,,,,,,2,1,
22752,9,Philippines,,,,,1,18,,,2,,,,54.799999,1,163.10001,1,,,,,,,,,,,,,1,1,20.600256
22547,10,Philippines,,,,,1,19,,,1,,,,63,1,169.89999,1,,,,,,,,,,,,,1,1,21.824978
13265,10,Philippines,,,,,2,45,3,15,2,0,,,64,1,150.8,1,28.143446,,3,,,,,,,,,,2,1,
12791,10,Philippines,,,,,2,47,1,6,1,0,,,51.900002,1,152.10001,1,22.434113,,2,,,,,,,,,,2,1,
22764,10,Philippines,,,,,1,18,,,1,,,,45.900002,1,170,1,,,,,,,,,,,,,1,1,15.882354
12764,10,Philippines,,,,,2,45,1,5,1,0,,,40.700001,1,158.7,1,16.159971,,1,,,,,,,,,,2,1,
22682,10,Philippines,,,,,2,18,,,1,,,,39.099998,1,163.10001,1,,,,,,,,,,,,,1,1,14.698357
12609,10,Philippines,,,,,2,58,1,0,1,0,,,48.700001,1,147.39999,1,22.414757,,2,,,,,,,,,,4,1,
13302,10,Philippines,,,,,2,37,2,10,1,0,,,74,1,155.7,1,30.524918,,4,,,,,,,,,,2,1,
22588,10,Philippines,,,,,1,18,,,1,,,,53.5,1,162,1,,,,,,,,,,,,,1,1,20.385612
12682,10,Philippines,,,,,2,44,2,9,1,0,,,53.099998,1,145.39999,1,25.116882,,3,,,,,,,,,,2,1,
12547,10,Philippines,,,,,2,45,1,4,1,0,,,59,1,157.8,1,23.693979,,2,,,,,,,,,,2,1,
22609,10,Philippines,,,,,2,19,,,1,,,,51.900002,1,153,1,,,,,,,,,,,,,1,1,22.170961
21986,10,Philippines,,,,,2,19,,,2,,,,53.900002,1,152.5,1,,,,,,,,,,,,,1,1,23.176565
12699,10,Philippines,,,,,2,57,1,6,1,0,,,75,1,157,1,30.427198,,4,,,,,,,,,,2,1,
22722,10,Philippines,,,,,2,19,,,1,,,,45.5,1,157,1,,,,,,,,,,,,,1,1,18.459167
23265,10,Philippines,,,,,1,19,,,2,,,,61.200001,1,167.89999,1,,,,,,,,,,,,,1,1,21.709513
20609,10,Philippines,,,,,2,18,,,2,,,,54.799999,1,145,1,,,,,,,,,,,,,1,1,26.064209
12753,10,Philippines,,,,,2,49,1,4,1,0,,,59.299999,1,149,1,26.710508,,3,,,,,,,,,,2,1,
23302,10,Philippines,,,,,2,19,,,1,,,,52,1,158.60001,1,,,,,,,,,,,,,1,1,20.672688
13162,10,Philippines,,,,,2,42,1,6,1,0,,,51.700001,1,152.2,1,22.318308,,2,,,,,,,,,,2,1,
11986,10,Philippines,,,,,2,48,1,2,2,0,,,57.099998,1,149,1,25.719561,,3,,,,,,,,,,2,1,
22791,10,Philippines,,,,,1,18,,,1,,,,54.900002,1,157,1,,,,,,,,,,,,,1,1,22.272709
23162,10,Philippines,,,,,2,19,,,1,,,,39.700001,1,144.89999,1,,,,,,,,,,,,,1,1,18.908356
22753,10,Philippines,,,,,2,18,,,1,,,,41.900002,1,150.5,1,,,,,,,,,,,,,1,1,18.498693
12588,10,Philippines,,,,,2,44,2,11,1,0,,,51.5,1,159.5,1,20.243511,,2,,,,,,,,,,2,1,
12722,10,Philippines,,,,,2,44,1,6,1,0,,,53.5,1,153.5,1,22.705811,,2,,,,,,,,,,2,1,
10609,10,Philippines,,,,,2,59,3,15,2,0,,,50.5,1,143.8,1,24.42157,,2,,,,,,,,,,2,1,
13103,10,Philippines,,,,,2,47,1,5,1,0,,,41,1,153.8,1,17.332897,,1,,,,,,,,,,2,1,
20610,11,Philippines,,,,,1,18,,,2,,,,58.5,1,169,1,,,,,,,,,,,,,1,3,20.482475
23163,11,Philippines,,,,,2,19,,,1,,,,39,1,156.3,1,,,,,,,,,,,,,1,1,15.964181
13270,11,Philippines,,,,,2,40,1,4,1,0,,,38,1,154.10001,1,16.002148,,1,,,,,,,,,,2,1,
22589,11,Philippines,,,,,2,18,2,11,1,,,,48.900002,1,149.39999,1,,,,,,,,,,,,,1,1,21.908251
22765,11,Philippines,,,,,2,18,,,1,,,,38.5,1,151.2,1,,,,,,,,,,,,,1,1,16.840584
22548,11,Philippines,,,,,1,19,,,1,,,,46.900002,1,158.39999,1,,,,,,,,,,,,,1,1,18.692291
13209,11,Philippines,,,,,2,49,1,2,1,0,,,54.700001,1,154.60001,1,22.885918,,2,,,,,,,,,,2,1,
12754,11,Philippines,,,,,2,44,1,4,1,0,,,65.800003,1,156.89999,1,26.728836,,3,,,,,,,,,,2,1,
12723,11,Philippines,,,,,2,42,1,6,1,0,,,56.900002,1,152.60001,1,24.434484,,2,,,,,,,,,,2,1,
23209,11,Philippines,,,,,1,19,,,1,,,,47.5,1,160.3,1,,,,,,,,,,,,,3,1,18.485302
12548,11,Philippines,,,,,2,50,1,4,1,0,,,34,1,143.10001,1,16.603498,,1,,,,,,,,,,2,1,
22723,11,Philippines,,,,,1,19,,,1,,,,48,1,159.89999,1,,,,,,,,,,,,,1,1,18.77346
22792,11,Philippines,,,,,1,18,,,2,,,,61,1,159,1,,,,,,,,,,,,,1,3,24.128792
10610,11,Philippines,,,,,2,42,3,12,2,0,,,67.699997,1,151.5,1,29.496017,,3,,,,,,,,,,2,3,
22754,11,Philippines,,,,,1,18,,,1,,,,62.799999,1,168.5,1,,,,,,,,,,,,,1,1,22.118711
23270,11,Philippines,,,,,2,18,,,1,,,,45.599998,1,152.8,1,,,,,,,,,,,,,1,1,19.530714
13163,11,Philippines,,,,,2,37,1,5,1,2,,,43.799999,1,158.5,1,17.434744,,1,,,,,,,,,,2,1,
12765,11,Philippines,,,,,2,38,2,8,1,0,,,42.5,1,146.7,1,19.748255,,2,,,,,,,,,,2,1,
12792,11,Philippines,,,,,2,45,1,6,1,0,,,48,1,151.39999,1,20.940619,,2,,,,,,,,,,2,3,
22724,12,Philippines,,,,,2,19,,,1,,,,58.799999,1,160.60001,1,,,,,,,,,,,,,1,1,22.797447
22683,12,Philippines,,,,,2,18,,,1,,,,40.299999,1,151.3,1,,,,,,,,,,,,,1,2,17.604641
22590,12,Philippines,,,,,2,18,,,1,,,,41.200001,1,147.5,1,,,,,,,,,,,,,1,1,18.937088
23164,12,Philippines,,,,,2,18,,,1,,,,57.599998,1,156.2,1,,,,,,,,,,,,,1,1,23.608067
12590,12,Philippines,,,,,2,43,2,10,1,0,,,41.5,1,155.60001,1,17.140713,,1,,,,,,,,,,2,1,
12793,12,Philippines,,,,,2,54,1,2,1,0,,,55.5,1,156.2,1,22.747356,,2,,,,,,,,,,4,1,
12549,12,Philippines,,,,,2,38,2,8,1,0,,,68.099998,1,158.7,1,27.039164,,3,,,,,,,,,,2,1,
12683,12,Philippines,,,,,2,48,1,5,1,0,,,45.799999,1,151.10001,1,20.060257,,2,,,,,,,,,,2,3,
23267,12,Philippines,,,,,2,18,,,1,,,,46,1,150.10001,1,,,,,,,,,,,,,1,1,20.417212
22793,12,Philippines,,,,,1,18,,,1,,,,61.799999,1,158.8,1,,,,,,,,,,,,,1,1,24.506847
13267,12,Philippines,,,,,2,52,2,8,1,0,,,32.700001,1,141.8,1,16.262798,,1,,,,,,,,,,2,1,
13164,12,Philippines,,,,,2,40,1,6,1,0,,,47.799999,1,152.3,1,20.607632,,2,,,,,,,,,,5,1,
12701,12,Philippines,,,,,2,51,1,6,1,0,,,43.799999,1,141.7,1,21.813955,,2,,,,,,,,,,2,1,
13105,12,Philippines,,,,,2,41,1,3,1,2,,,42.900002,1,146.10001,1,20.098185,,2,,,,,,,,,,2,1,
22549,12,Philippines,,,,,2,19,,,1,,,,43.099998,1,150.7,1,,,,,,,,,,,,,1,1,18.978014
23105,12,Philippines,,,,,1,19,,,1,,,,41.099998,1,151.5,1,,,,,,,,,,,,,1,1,17.90674
12724,12,Philippines,,,,,2,45,1,6,1,0,,,63.5,1,159.60001,1,24.929176,,2,,,,,,,,,,2,1,
20623,13,Philippines,,,,,1,19,,,2,,,,61.799999,1,168,1,,,,,,,,,,,,,1,1,21.896257
10612,13,Philippines,,,,,2,51,3,15,2,0,,,73.900002,1,150.60001,1,32.583256,,4,,,,,,,,,,2,1,
10623,13,Philippines,,,,,2,47,3,15,2,0,,,60.5,1,154.10001,1,25.477104,,3,,,,,,,,,,2,1,
22852,13,Philippines,,,,,2,19,,,1,,,,41,1,151.5,1,,,,,,,,,,,,,1,1,17.863173
12702,13,Philippines,,,,,2,60,1,2,1,0,,,63.299999,1,149.60001,1,28.283978,,3,,,,,,,,,,2,1,
12852,13,Philippines,,,,,2,52,1,4,1,0,,,50,1,148.2,1,22.765312,,2,,,,,,,,,,2,1,
12684,13,Philippines,,,,,2,48,1,6,1,0,,,39.099998,1,140.3,1,19.863756,,2,,,,,,,,,,2,1,
22550,13,Philippines,,,,,1,19,,,1,,,,51,1,165.60001,1,,,,,,,,,,,,,5,1,18.597282
23106,13,Philippines,,,,,1,19,,,1,,,,56,1,167.8,1,,,,,,,,,,,,,1,1,19.888596
23211,13,Philippines,,,,,2,19,,,2,,,,41,1,156,1,,,,,,,,,,,,,1,1,16.847469
12794,13,Philippines,,,,,2,61,1,3,1,0,,,41,1,153,1,17.514631,,1,,,,,,,,,,2,1,
12591,13,Philippines,,,,,2,54,1,5,1,0,,,50.799999,1,156.3,1,20.794369,,2,,,,,,,,,,2,1,
22591,13,Philippines,,,,,1,18,,,1,,,,56.799999,1,170.3,1,,,,,,,,,,,,,1,1,19.584795
13211,13,Philippines,,,,,2,41,1,2,1,0,,,50.799999,1,154.7,1,21.22673,,2,,,,,,,,,,2,1,
13268,13,Philippines,,,,,2,53,1,4,1,0,,,48,1,149.89999,1,21.361809,,2,,,,,,,,,,2,1,
12550,13,Philippines,,,,,2,37,1,5,1,0,,,43.599998,1,148.8,1,19.691582,,2,,,,,,,,,,2,1,
12767,13,Philippines,,,,,2,51,1,5,1,0,,,37,1,143.60001,1,17.942907,,1,,,,,,,,,,2,1,
13106,13,Philippines,,,,,2,44,1,6,1,0,,,41.900002,1,147.10001,1,19.363714,,2,,,,,,,,,,4,1,
10476,13,Philippines,,,,,2,41,2,10,2,0,,,46.900002,1,149.8,1,20.900141,,2,,,,,,,,,,2,1,
22082,13,Philippines,,,,,1,19,,,2,,,,53,1,164,1,,,,,,,,,,,,,1,1,19.705532
22794,13,Philippines,,,,,1,18,,,1,,,,44.799999,1,152.10001,1,,,,,,,,,,,,,1,1,19.365091
23268,13,Philippines,,,,,2,18,,,1,,,,40,1,158.89999,1,,,,,,,,,,,,,1,1,15.842081
12611,13,Philippines,,,,,2,39,1,6,1,0,,,46,1,148.2,1,20.944088,,2,,,,,,,,,,2,1,
20612,13,Philippines,,,,,1,18,,,2,,,,47.700001,1,163.7,1,,,,,,,,,,,,,1,1,17.800043
20476,13,Philippines,,,,,1,19,,,2,,,,70,1,166.60001,1,,,,,,,,,,,,,1,1,25.220171
22702,13,Philippines,,,,,2,19,,,1,,,,41.700001,1,143.2,1,,,,,,,,,,,,,1,1,20.335276
12082,13,Philippines,,,,,2,61,1,6,2,0,,,55.200001,1,147.3,1,25.440964,,3,,,,,,,,,,4,1,
22551,14,Philippines,,,,,1,19,,,1,,,,50,1,162,1,,,,,,,,,,,,,1,1,19.051973
12083,14,Philippines,,,,,2,43,3,15,2,0,,,60.5,1,163.2,1,22.715122,,2,,,,,,,,,,2,1,
22685,14,Philippines,,,,,1,18,,,1,,,,51.400002,1,163.39999,1,,,,,,,,,,,,,1,1,19.251255
12551,14,Philippines,,,,,2,38,1,1,1,0,,,38,1,146.5,1,17.705505,,1,,,,,,,,,,2,1,
12592,14,Philippines,,,,,2,40,1,5,1,0,,,66.099998,1,147.8,1,30.25886,,4,,,,,,,,,,5,1,
13306,14,Philippines,,,,,2,40,3,12,1,2,,,90,1,160.7,1,34.850639,,4,,,,,,,,,,2,1,
13269,14,Philippines,,,,,2,40,1,4,1,0,,,56,1,146.8,1,25.985788,,3,,,,,,,,,,2,1,
13165,14,Philippines,,,,,2,45,1,2,1,0,,,50.200001,1,151.10001,1,21.987444,,2,,,,,,,,,,2,1,
22083,14,Philippines,,,,,1,19,,,2,,,,62.5,1,176.3,1,,,,,,,,,,,,,1,1,20.108301
23306,14,Philippines,,,,,2,18,,,1,,,,44.299999,1,157.2,1,,,,,,,,,,,,,1,1,17.92663
20624,14,Philippines,,,,,1,19,,,2,,,,62.099998,1,166.8,1,,,,,,,,,,,,,1,1,22.320272
10477,14,Philippines,,,,,2,65,1,6,2,0,,,79.900002,1,155.5,1,33.043495,,4,,,,,,,,,,2,1,
12612,14,Philippines,,,,,2,38,2,10,1,0,,,61.599998,1,154.7,1,25.7395,,3,,,,,,,,,,2,1,
22795,14,Philippines,,,,,1,18,,,1,,,,50,1,164,1,,,,,,,,,,,,,1,1,18.590124
12768,14,Philippines,,,,,2,60,1,5,1,0,,,51,1,156.2,1,20.902977,,2,,,,,,,,,,4,1,
12685,14,Philippines,,,,,2,44,1,6,1,0,,,42,1,155.60001,1,17.347227,,1,,,,,,,,,,2,1,
23269,14,Philippines,,,,,2,18,,,1,,,,43.799999,1,149.7,1,,,,,,,,,,,,,1,1,19.544767
22726,14,Philippines,,,,,1,18,,,2,,,,54.299999,1,170.60001,1,,,,,,,,,,,,,1,1,18.656998
12726,14,Philippines,,,,,2,45,1,6,1,2,,,43.700001,1,161.2,1,16.81711,,1,,,,,,,,,,2,1,
23107,14,Philippines,,,,,1,19,1,5,1,,,,49.700001,1,164.8,1,,,,,,,,,,,,,1,1,18.299616
22703,14,Philippines,,,,,1,18,,,2,,,,56,1,160,1,,,,,,,,,,,,,1,1,21.875
22768,14,Philippines,,,,,1,18,,,1,,,,50.900002,1,160.60001,1,,,,,,,,,,,,,1,1,19.734526
20477,14,Philippines,,,,,1,18,,,2,,,,60.099998,1,159.5,1,,,,,,,,,,,,,1,1,23.623981
12853,14,Philippines,,,,,2,44,1,6,1,0,,,44.900002,1,154,1,18.932367,,2,,,,,,,,,,2,1,
12703,14,Philippines,,,,,2,50,1,3,1,0,,,52.900002,1,149.89999,1,23.542494,,2,,,,,,,,,,2,1,
12795,14,Philippines,,,,,2,42,2,10,1,0,,,60,1,146.5,1,27.956062,,3,,,,,,,,,,2,1,
10624,14,Philippines,,,,,2,39,1,6,2,0,,,59.099998,1,161.3,1,22.715313,,2,,,,,,,,,,2,1,
22686,15,Philippines,,,,,1,18,,,1,,,,45.799999,1,151.39999,1,,,,,,,,,,,,,1,1,19.980841
22769,15,Philippines,,,,,1,18,,,1,,,,43.5,1,161.2,1,,,,,,,,,,,,,1,2,16.740145
12686,15,Philippines,,,,,2,42,1,3,1,0,,,46.799999,1,149.5,1,20.939363,,2,,,,,,,,,,2,1,
12613,15,Philippines,,,,,2,39,1,6,1,0,,,50.200001,1,150.2,1,22.251736,,2,,,,,,,,,,2,1,
11536,15,Philippines,,,,,2,45,1,6,2,0,,,55,1,154.2,1,23.130976,,2,,,,,,,,,,2,1,
12758,15,Philippines,,,,,2,40,1,4,1,2,,,46.599998,1,147,1,21.565088,,2,,,,,,,,,,2,1,
21536,15,Philippines,,,,,2,19,,,2,,,,49.5,1,144.60001,1,,,,,,,,,,,,,1,1,23.673832
10898,15,Philippines,,,,,2,44,3,15,2,0,,,56.599998,1,151.8,1,24.562517,,2,,,,,,,,,,2,1,
22796,15,Philippines,,,,,2,19,,,1,,,,50.299999,1,142,1,,,,,,,,,,,,,1,1,24.945446
22593,15,Philippines,,,,,1,18,,,1,,,,50.200001,1,160.60001,1,,,,,,,,,,,,,1,1,19.463127
23166,15,Philippines,,,,,1,18,,,1,,,,49,1,164.89999,1,,,,,,,,,,,,,1,1,18.02
13166,15,Philippines,,,,,2,48,1,4,1,0,,,59,1,150.5,1,26.048277,,3,,,,,,,,,,2,1,
22613,15,Philippines,,,,,2,19,,,1,,,,41.200001,1,148.8,1,,,,,,,,,,,,,1,1,18.607641
12796,15,Philippines,,,,,2,37,1,6,1,0,,,47,1,150,1,20.888889,,2,,,,,,,,,,2,1,
22758,15,Philippines,,,,,1,18,,,1,,,,46.799999,1,162.60001,1,,,,,,,,,,,,,1,1,17.701283
12593,15,Philippines,,,,,2,57,1,5,1,0,,,42.099998,1,153.5,1,17.867563,,1,,,,,,,,,,2,1,
13108,15,Philippines,,,,,2,45,1,6,1,0,,,63.900002,1,155.7,1,26.358681,,3,,,,,,,,,,3,1,
12769,15,Philippines,,,,,2,40,1,6,1,0,,,45,1,154.89999,1,18.754683,,2,,,,,,,,,,2,2,
20898,15,Philippines,,,,,1,19,,,2,,,,58,1,167.5,1,,,,,,,,,,,,,1,1,20.672756
10141,16,Philippines,,,,,2,52,3,15,2,0,,,53,1,148.83,1,23.927366,,2,,,,,,,,,,5,1,
10614,16,Philippines,,,,,2,42,2,9,2,0,,,55.900002,1,150.5,1,24.67964,,2,,,,,,,,,,2,1,
21385,16,Philippines,,,,,2,19,,,2,,,,49.799999,1,155.10001,1,,,,,,,,,,,,,1,1,20.701685
10625,16,Philippines,,,,,2,47,2,11,2,0,,,52,1,150.7,1,22.89691,,2,,,,,,,,,,2,1,
22705,16,Philippines,,,,,2,18,,,1,,,,48,1,150.5,1,,,,,,,,,,,,,1,1,21.191818
11989,16,Philippines,,,,,2,39,2,10,2,0,,,55.299999,1,154,1,23.317591,,2,,,,,,,,,,2,1,
12687,16,Philippines,,,,,2,48,1,4,1,0,,,44.900002,1,144.7,1,21.444174,,2,,,,,,,,,,2,1,
20141,16,Philippines,,,,,1,18,,,2,,,,74,1,165.39999,1,,,,,,,,,,,,,1,3,27.049593
22614,16,Philippines,,,,,2,19,,,1,,,,44.900002,1,146.3,1,,,,,,,,,,,,,1,1,20.977692
22687,16,Philippines,,,,,1,18,,,1,,,,41.200001,1,155.39999,1,,,,,,,,,,,,,1,1,17.060637
20614,16,Philippines,,,,,1,18,,,2,,,,52.5,1,160.8,1,,,,,,,,,,,,,1,1,20.304262
20625,16,Philippines,,,,,2,19,,,1,,,,40.299999,1,150.60001,1,,,,,,,,,,,,,1,1,17.768675
22553,16,Philippines,,,,,1,19,,,1,,,,51.799999,1,161.60001,1,,,,,,,,,,,,,1,1,19.835676
12728,16,Philippines,,,,,2,47,1,5,1,0,,,50.700001,1,149.3,1,22.745125,,2,,,,,,,,,,2,1,
22770,16,Philippines,,,,,2,18,,,1,,,,42,1,154.10001,1,,,,,,,,,,,,,1,1,17.686584
12553,16,Philippines,,,,,2,47,2,8,1,0,,,43.799999,1,153.8,1,18.516607,,2,,,,,,,,,,2,1,
22728,16,Philippines,,,,,2,19,,,1,,,,50.299999,1,151.8,1,,,,,,,,,,,,,1,1,21.828526
11385,16,Philippines,,,,,2,47,1,2,2,0,,,54.5,1,155.60001,1,22.510092,,2,,,,,,,,,,2,1,
12770,16,Philippines,,,,,2,40,1,6,1,0,,,49.200001,1,156.8,1,20.011192,,2,,,,,,,,,,2,1,
12614,16,Philippines,,,,,2,56,1,3,1,0,,,31.9,1,145.7,1,15.026976,,1,,,,,,,,,,5,1,
12705,16,Philippines,,,,,2,48,1,6,1,0,,,52,1,151.8,1,22.566271,,2,,,,,,,,,,2,1,
10626,17,Philippines,,,,,2,44,3,17,2,0,,,56,1,151,1,24.560326,,2,,,,,,,,,,5,1,
12798,17,Philippines,,,,,2,49,1,5,1,0,,,44.900002,1,150.3,1,19.875973,,2,,,,,,,,,,2,1,
23309,17,Philippines,,,,,1,18,,,1,,,,52.700001,1,163.60001,1,,,,,,,,,,,,,1,1,19.689922
22615,17,Philippines,,,,,1,19,,,1,,,,56,1,159.39999,1,,,,,,,,,,,,,1,1,22.039991
12771,17,Philippines,,,,,2,39,1,4,1,2,,,43,1,146,1,20.17264,,2,,,,,,,,,,2,1,
11386,17,Philippines,,,,,2,37,3,12,2,0,,,71,1,149.39999,1,31.809525,,4,,,,,,,,,,3,1,
20899,17,Philippines,,,,,1,18,,,2,,,,63.400002,1,175.2,1,,,,,,,,,,,,,1,1,20.654804
10899,17,Philippines,,,,,2,46,2,10,2,0,,,89.900002,1,158.7,1,35.694874,,4,,,,,,,,,,3,1,
21386,17,Philippines,,,,,2,19,,,2,,,,59,1,156.39999,1,,,,,,,,,,,,,1,1,24.12007
10478,17,Philippines,,,,,2,43,1,6,2,0,,,64.900002,1,156.2,1,26.600063,,3,,,,,,,,,,2,1,
22798,17,Philippines,,,,,1,18,,,1,,,,45.900002,1,163.60001,1,,,,,,,,,,,,,1,1,17.149286
20478,17,Philippines,,,,,2,18,,,2,,,,47.299999,1,159.8,1,,,,,,,,,,,,,1,1,18.52284
12595,17,Philippines,,,,,2,51,1,6,1,0,,,66.800003,1,150.5,1,29.491949,,3,,,,,,,,,,2,1,
22554,17,Philippines,,,,,1,19,2,11,1,,,,53.299999,1,162.89999,1,,,,,,,,,,,,,1,1,20.085611
20615,17,Philippines,,,,,2,18,,,2,,,,35.900002,1,154.8,1,,,,,,,,,,,,,1,1,14.981404
23271,17,Philippines,,,,,1,18,,,1,,,,56.900002,1,162.2,1,,,,,,,,,,,,,1,1,21.627712
22595,17,Philippines,,,,,2,18,,,1,,,,51.299999,1,152.7,1,,,,,,,,,,,,,1,1,22.000841
12086,17,Philippines,,,,,2,50,1,6,2,0,,,38.900002,1,144.89999,1,18.527332,,2,,,,,,,,,,2,1,
12856,17,Philippines,,,,,2,40,2,8,1,2,,,48.900002,1,143.3,1,23.813129,,2,,,,,,,,,,2,1,
13271,17,Philippines,,,,,2,55,1,1,1,0,,,34.900002,1,137,1,18.594492,,2,,,,,,,,,,2,1,
12615,17,Philippines,,,,,2,53,1,3,1,0,,,30,1,143.39999,1,14.588915,,1,,,,,,,,,,2,1,
13309,17,Philippines,,,,,2,55,3,15,1,0,,,40.700001,1,149.5,1,18.210087,,1,,,,,,,,,,2,1,
20626,17,Philippines,,,,,2,19,,,2,,,,42.5,1,151.5,1,,,,,,,,,,,,,1,1,18.516703
22086,17,Philippines,,,,,2,19,,,2,,,,35.900002,1,144,1,,,,,,,,,,,,,1,1,17.312887
13109,17,Philippines,,,,,2,60,2,8,1,0,,,63.099998,1,156.8,1,25.664761,,3,,,,,,,,,,2,1,
10615,17,Philippines,,,,,2,51,3,17,1,0,,,69,1,151.39999,1,30.10214,,4,,,,,,,,,,2,1,
12596,18,Philippines,,,,,2,48,1,6,1,0,,,52.700001,1,148.2,1,23.99464,,2,,,,,,,,,,2,2,
22087,18,Philippines,,,,,2,19,,,2,,,,45.900002,1,149.8,1,,,,,,,,,,,,,1,1,20.45451
10244,18,Philippines,,,,,2,56,1,4,2,0,,,55.900002,1,150,1,24.844444,,2,,,,,,,,,,4,1,
12616,18,Philippines,,,,,2,41,2,8,1,0,,,46.299999,1,146.2,1,21.661386,,2,,,,,,,,,,2,1,
12799,18,Philippines,,,,,2,37,2,9,1,0,,,44.5,1,157.7,1,17.893555,,1,,,,,,,,,,2,1,
22857,18,Philippines,,,,,1,19,,,1,,,,50,1,165.5,1,,,,,,,,,,,,,1,1,18.254671
10627,18,Philippines,,,,,2,37,1,6,2,0,,,57.700001,1,154.2,1,24.266497,,2,,,,,,,,,,2,1,
12689,18,Philippines,,,,,2,41,1,6,1,2,,,41,1,147.3,1,18.896368,,2,,,,,,,,,,2,3,
20627,18,Philippines,,,,,2,19,,,2,,,,36,1,147,1,,,,,,,,,,,,,1,1,16.659725
20244,18,Philippines,,,,,1,18,,,2,,,,55.700001,1,164,1,,,,,,,,,,,,,1,1,20.7094
23272,18,Philippines,,,,,1,19,,,1,,,,52.099998,1,164,1,,,,,,,,,,,,,1,1,19.370909
13272,18,Philippines,,,,,2,44,2,9,2,0,,,59.099998,1,151.3,1,25.817226,,3,,,,,,,,,,2,1,