id,hh_id,country,sec_area,tert_area,round,smpl_weight,sex,age,edc_level,edc,residence,preg_lact,breastfeeding,hh_head,wgt,wgt_method,hgt,hgt_method,bmi_adults,bmi_children,bmi_cat,misrep,pa,pa_cat,smok,special_diet,special_diet_other,clin_diet,clin_diet_other,note
11400101,,Italy,6,,1,,1,42,2,3,1,0,,,92,2,185,2,26.880936,,3,,,,,0,,,,
11400102,,Italy,6,,1,,2,36,2,4,1,0,,,96,2,170,2,33.217995,,4,,,,,0,,,,
11400103,,Italy,6,,1,,1,12,,,1,0,,,40,2,155,2,,,,,,,,0,,,,
11400104,,Italy,6,,1,,2,10,,,1,0,,,37,2,149,2,,,,,,,,0,,,,
11400201,,Italy,6,,1,,1,55,3,6,1,0,,,93,2,181,2,28.387411,,3,,,,,0,,,,
11400301,,Italy,6,,1,,1,50,2,3,1,0,,,85,2,175,2,27.755102,,3,,,,,0,,,,
11400302,,Italy,6,,1,,2,45,2,4,1,0,,,99,2,165,2,36.363636,,4,,,,,0,,,,
11400303,,Italy,6,,1,,2,22,2,4,1,0,,,57,2,168,2,20.195578,,2,,,,,0,,,,
11400304,,Italy,6,,1,,1,17,2,3,1,0,,,65,2,170,2,,,,,,,,0,,,,
11400401,,Italy,6,,1,,1,48,2,3,1,0,,,62,2,170,2,21.453287,,2,,,,,0,,,,
11400501,,Italy,6,,1,,1,56,2,3,1,0,,,73,2,164,2,27.141582,,3,,,,,0,,,,
11400502,,Italy,6,,1,,2,50,2,3,1,0,,,64,2,155,2,26.638918,,3,,,,,,,,,
11400601,,Italy,6,,1,,2,72,1,2,1,0,,,90,2,165,2,33.05785,,4,,,,,0,,,,
11400602,,Italy,6,,1,,1,45,2,4,1,0,,,82,2,175,2,26.775511,,3,,,,,0,,,,
11400701,,Italy,6,,1,,1,51,2,4,1,0,,,66,2,178,2,20.830704,,2,,,,,0,,,,
11400702,,Italy,6,,1,,2,47,2,4,1,0,,,75,2,163,2,28.228386,,3,,,,,0,,,,
11400801,,Italy,6,,1,,1,72,1,2,1,0,,,81,2,170,2,28.027681,,3,,,,,0,,,,
11400802,,Italy,6,,1,,2,69,1,2,1,0,,,65,2,165,2,23.875114,,2,,,,,0,,,,
11400901,,Italy,6,,1,,1,38,2,3,1,0,,,74,2,180,2,22.839506,,2,,,,,0,,,,
11400902,,Italy,6,,1,,2,67,1,2,1,0,,,55,2,160,2,21.484375,,2,,,,,0,,,,
11401001,,Italy,6,,1,,2,73,2,3,1,0,,,65,2,160,2,25.390625,,3,,,,,0,,,,
11401101,,Italy,6,,1,,2,82,1,2,1,0,,,70,2,161,2,27.005131,,3,,,,,0,,,,
11401201,,Italy,6,,1,,1,47,2,4,1,0,,,81,2,190,2,22.437674,,2,,,,,0,,,,
11401202,,Italy,6,,1,,2,49,2,4,1,0,,,50,2,160,2,19.53125,,2,,,,,0,,,,
11401203,,Italy,6,,1,,2,20,2,4,1,0,,,52,2,165,2,19.100092,,2,,,,,0,,,,
11401204,,Italy,6,,1,,2,16,2,3,1,0,,,55,2,175,2,,,,,,,,0,,,,
11401301,,Italy,6,,1,,1,47,2,4,1,0,,,65,2,175,2,21.224489,,2,,,,,0,,,,
11401302,,Italy,6,,1,,2,52,3,6,1,0,,,50,2,150,2,22.222221,,2,,,,,0,,,,
11401401,,Italy,6,,1,,1,45,2,4,1,0,,,78,2,180,2,24.074074,,2,,,,,0,,,,
11401402,,Italy,6,,1,,2,43,2,3,1,0,,,53,2,158,2,21.230572,,2,,,,,0,,,,
11401403,,Italy,6,,1,,1,18,2,3,1,0,,,83,2,180,2,,,,,,,,0,,,,
11401404,,Italy,6,,1,,1,15,2,3,1,0,,,60,2,182,2,,,,,,,,0,,,,
11401501,,Italy,6,,1,,1,57,2,3,1,0,,,78,2,180,2,24.074074,,2,,,,,0,,,,
11401601,,Italy,6,,1,,1,45,2,3,1,0,,,76,2,170,2,26.297577,,3,,,,,0,,,,
11401602,,Italy,6,,1,,2,41,3,6,1,0,,,60,2,160,2,23.4375,,2,,,,,0,,,,
11401603,,Italy,6,,1,,1,12,,,1,0,,,36,2,147,2,,,,,,,,0,,,,
11401701,,Italy,6,,1,,1,65,2,3,1,0,,,64,2,178,2,20.199471,,2,,,,,0,,,,
11401702,,Italy,6,,1,,2,60,1,2,1,0,,,52,2,157,2,21.096191,,2,,,,,0,,,,
11401801,,Italy,6,,1,,1,54,2,4,1,0,,,110,2,180,2,33.950619,,4,,,,,0,,,,Potential outlier for weight
11401802,,Italy,6,,1,,2,52,2,4,1,0,,,58,2,160,2,22.65625,,2,,,,,0,,,,
11401901,,Italy,6,,1,,1,57,2,4,1,0,,,70,2,151,2,30.700407,,4,,,,,0,,,,
11401902,,Italy,6,,1,,2,60,1,2,1,0,,,70,2,160,2,27.34375,,3,,,,,0,,,,
11402001,,Italy,6,,1,,2,68,1,2,1,0,,,74,2,165,2,27.180901,,3,,,,,0,,,,
11402002,,Italy,6,,1,,2,39,2,3,1,0,,,49,2,150,2,21.777779,,2,,,,,0,,,,
11402101,,Italy,6,,1,,2,67,1,2,1,0,,,52,2,156,2,21.367521,,2,,,,,0,,,,
11402201,,Italy,6,,1,,1,67,2,4,1,0,,,78,2,170,2,26.98962,,3,,,,,0,,,,
11402202,,Italy,6,,1,,2,65,1,2,1,0,,,92,2,164,2,34.20583,,4,,,,,0,,,,
11402301,,Italy,6,,1,,2,55,2,3,1,0,,,78,2,167,2,27.968016,,3,,,,,3,,,,
11402401,,Italy,6,,1,,2,70,2,3,1,0,,,56,2,165,2,20.56933,,2,,,,,0,,,,
11402501,,Italy,6,,1,,2,67,1,2,1,0,,,85,2,165,2,31.221304,,4,,,,,0,,,,
11402601,,Italy,6,,1,,1,40,2,4,1,0,,,58,2,168,2,20.549887,,2,,,,,0,,,,
11402602,,Italy,6,,1,,2,62,2,3,1,0,,,56,2,160,2,21.875,,2,,,,,0,,,,
11402701,,Italy,6,,1,,1,45,2,4,1,0,,,64,2,175,2,20.897959,,2,,,,,0,,,,
11402702,,Italy,6,,1,,2,44,2,4,1,0,,,48,2,155,2,19.979189,,2,,,,,0,,,,
11402703,,Italy,6,,1,,1,19,2,3,1,0,,,58,2,172,2,,,,,,,,0,,,,
11402704,,Italy,6,,1,,1,16,2,3,1,0,,,56,2,170,2,,,,,,,,0,,,,
11402801,,Italy,6,,1,,1,49,2,3,1,0,,,63,2,168,2,22.321428,,2,,,,,,,,,
11402802,,Italy,6,,1,,2,43,2,3,1,0,,,60,2,168,2,21.258503,,2,,,,,0,,,,
11402803,,Italy,6,,1,,1,18,2,3,1,0,,,70,2,180,2,,,,,,,,0,,,,
11402804,,Italy,6,,1,,1,13,,,1,0,,,56,2,170,2,,,,,,,,0,,,,
11402901,,Italy,6,,1,,1,68,2,3,1,0,,,63,2,165,2,23.140495,,2,,,,,0,,,,
11402902,,Italy,6,,1,,2,56,2,3,1,0,,,50,2,155,2,20.811655,,2,,,,,0,,,,
11402903,,Italy,6,,1,,2,29,3,6,1,0,,,45,2,155,2,18.73049,,2,,,,,0,,,,
11402904,,Italy,6,,1,,2,26,3,6,1,0,,,52,2,158,2,20.829996,,2,,,,,0,,,,
11403001,,Italy,6,,1,,1,58,2,4,1,0,,,79,2,170,2,27.33564,,3,,,,,0,,,,
11403002,,Italy,6,,1,,2,56,2,3,1,0,,,58,2,168,2,20.549887,,2,,,,,0,,,,
11403101,,Italy,6,,1,,1,78,2,3,1,0,,,70,2,164,2,26.026175,,3,,,,,0,,,,
11403102,,Italy,6,,1,,2,68,2,3,1,0,,,75,2,160,2,29.296875,,3,,,,,0,,,,
11403103,,Italy,6,,1,,1,43,2,4,1,0,,,70,2,174,2,23.120625,,2,,,,,0,,,,
11403201,,Italy,6,,1,,1,51,2,3,1,0,,,72,2,172,2,24.337481,,2,,,,,0,,,,
11403202,,Italy,6,,1,,2,49,2,3,1,0,,,70,2,170,2,24.221453,,2,,,,,0,,,,
11403301,,Italy,6,,1,,2,39,2,4,1,0,,,56,2,158,2,22.432302,,2,,,,,0,,,,
11403302,,Italy,6,,1,,1,54,2,4,1,0,,,84,2,178,2,26.511805,,3,,,,,0,,,,
11403303,,Italy,6,,1,,1,17,2,3,1,0,,,68,2,178,2,,,,,,,,0,,,,
11403304,,Italy,6,,1,,1,16,2,3,1,0,,,69,2,178,2,,,,,,,,0,,,,
11403401,,Italy,6,,1,,1,62,2,3,1,0,,,61,2,163,2,22.959087,,2,,,,,0,,,,
11403402,,Italy,6,,1,,2,58,2,3,1,0,,,54,2,154,2,22.769438,,2,,,,,0,,,,
11403403,,Italy,6,,1,,1,31,3,6,1,0,,,65,2,175,2,21.224489,,2,,,,,0,,,,
11403404,,Italy,6,,1,,2,17,2,3,1,0,,,53,2,155,2,,,,,,,,0,,,,
11403501,,Italy,6,,1,,1,51,1,2,1,0,,,61,2,165,2,22.405876,,2,,,,,0,,,,
11403502,,Italy,6,,1,,2,42,2,3,1,0,,,65,2,165,2,23.875114,,2,,,,,0,,,,
11403601,,Italy,6,,1,,1,60,2,4,1,0,,,64,2,161,2,24.690405,,2,,,,,0,,,,
11403701,,Italy,6,,1,,1,75,1,2,1,0,,,70,2,175,2,22.857143,,2,,,,,0,,,,
11403702,,Italy,6,,1,,2,68,1,2,1,0,,,59,2,162,2,22.481329,,2,,,,,0,,,,
11403801,,Italy,6,,1,,1,47,2,3,1,0,,,70,2,173,2,23.388687,,2,,,,,0,,,,
11403802,,Italy,6,,1,,2,44,2,3,1,0,,,55,2,168,2,19.486961,,2,,,,,0,,,,
11403901,,Italy,6,,1,,2,75,3,6,1,0,,,42,2,156,2,17.258383,,1,,,,,0,,,,
11404001,,Italy,6,,1,,2,80,1,2,1,0,,,80,2,167,2,28.685144,,3,,,,,0,,,,
11404002,,Italy,6,,1,,1,78,1,2,1,0,,,79,2,162,2,30.102119,,4,,,,,0,,,,
11404101,,Italy,6,,1,,1,50,2,4,1,0,,,83,2,183,2,24.784258,,2,,,,,0,,,,
11404102,,Italy,6,,1,,2,47,2,4,1,0,,,53,2,160,2,20.703125,,2,,,,,0,,,,
11404103,,Italy,6,,1,,2,22,2,4,1,0,,,70,2,170,2,24.221453,,2,,,,,0,,,,
11404104,,Italy,6,,1,,2,18,2,3,1,0,,,57,2,168,2,,,,,,,,0,,,,
11404201,,Italy,6,,1,,1,57,2,3,1,0,,,62,2,165,2,22.773186,,2,,,,,0,,,,
11404202,,Italy,6,,1,,2,53,1,2,1,0,,,56,2,155,2,23.309053,,2,,,,,0,,,,
11404203,,Italy,6,,1,,2,30,3,7,1,0,,,48,2,158,2,19.227688,,2,,,,,0,,,,
11404204,,Italy,6,,1,,1,19,2,4,1,0,,,60,2,175,2,,,,,,,,0,,,,
12110101,,Italy,8,,1,,1,43,2,4,1,0,,,72,2,162,2,27.434843,,3,,,,,0,,,,
12110102,,Italy,8,,1,,2,37,2,3,1,0,,,48,2,160,2,18.75,,2,,,,,0,,,,
12110103,,Italy,8,,1,,2,13,,,1,0,,,45,2,158,2,,,,,,,,0,,,,
12110104,,Italy,8,,1,,2,6,,,1,0,,,25,2,120,2,,,,,,,,0,,,,
12110201,,Italy,8,,1,,2,84,1,2,1,0,,,80,2,163,2,30.110279,,4,,,,,0,,,,
12110301,,Italy,8,,1,,1,50,2,3,1,0,,,72,2,167,2,25.816629,,3,,,,,0,,,,
12110401,,Italy,8,,1,,2,57,2,3,1,0,,,59,2,157,2,23.936062,,2,,,,,0,,,,
12110402,,Italy,8,,1,,1,58,1,2,1,0,,,75,2,178,2,23.671253,,2,,,,,0,,,,
12110404,,Italy,8,,1,,1,29,2,4,1,0,,,70,2,178,2,22.09317,,2,,,,,0,,,,
12110501,,Italy,8,,1,,2,42,3,5,1,0,,,54,2,158,2,21.631149,,2,,,,,0,,,,
12110502,,Italy,8,,1,,1,44,2,4,1,0,,,80,2,185,2,23.374725,,2,,,,,0,,,,
12110504,,Italy,8,,1,,1,5,,,1,0,,,20,2,110,2,,,,,,,,0,,,,
12110505,,Italy,8,,1,,2,18,2,3,1,0,,,70,2,167,2,,,,,,,,0,,,,
12110506,,Italy,8,,1,,2,9,,,1,0,,,30,2,120,2,,,,,,,,0,,,,
12110601,,Italy,8,,1,,1,36,3,5,1,0,,,80,2,175,2,26.12245,,3,,,,,0,,,,
12110602,,Italy,8,,1,,2,38,3,6,1,2,,,70,2,170,2,24.221453,,2,,,,,0,,,,
12110604,,Italy,8,,1,,2,.33000001,,,1,0,,,8,2,65,2,,,,,,,,0,,,,
12110801,,Italy,8,,1,,2,55,2,4,1,0,,,65,2,165,2,23.875114,,2,,,,,0,,,,
12110804,,Italy,8,,1,,1,35,2,3,1,0,,,58,2,170,2,20.069204,,2,,,,,0,,,,
12111001,,Italy,8,,1,,1,68,1,2,1,0,,,95,2,165,2,34.894398,,4,,,,,0,,,,
12111002,,Italy,8,,1,,2,69,1,2,1,0,,,70,2,160,2,27.34375,,3,,,,,0,,,,
12111101,,Italy,8,,1,,2,91,1,2,1,0,,,49,2,156,2,20.134779,,2,,,,,0,,,,
12111109,,Italy,8,,1,,2,87,1,2,1,0,,,59,2,160,2,23.046875,,2,,,,,0,,,,
12111201,,Italy,8,,1,,2,47,2,4,1,0,,,50,2,157,2,20.284798,,2,,,,,0,,,,
12111301,,Italy,8,,1,,1,34,2,3,1,0,,,64,2,171,2,21.887075,,2,,,,,0,,,,
12111302,,Italy,8,,1,,2,35,2,3,1,0,,,53,2,164,2,19.705532,,2,,,,,0,,,,
12111303,,Italy,8,,1,,1,8,,,1,0,,,23,2,130,2,,,,,,,,0,,,,
12111304,,Italy,8,,1,,1,4,,,1,0,,,18,2,110,2,,,,,,,,0,,,,
12111401,,Italy,8,,1,,1,65,1,2,1,0,,,88,2,183,2,26.277285,,3,,,,,0,,,,
12111501,,Italy,8,,1,,2,50,3,6,1,0,,,56,2,165,2,20.56933,,2,,,,,0,,,,
12111502,,Italy,8,,1,,1,47,2,4,1,0,,,75,2,168,2,26.57313,,3,,,,,0,,,,
12111503,,Italy,8,,1,,2,13,,,1,0,,,33,2,140,2,,,,,,,,0,,,,
12111601,,Italy,8,,1,,1,55,2,3,1,0,,,67,2,168,2,23.738663,,2,,,,,0,,,,
12111602,,Italy,8,,1,,2,56,3,5,1,0,,,46,2,158,2,18.426535,,1,,,,,0,,,,
12111603,,Italy,8,,1,,2,28,3,6,1,0,,,60,2,163,2,22.582708,,2,,,,,0,,,,
12111701,,Italy,8,,1,,2,41,2,4,1,0,,,50,2,170,2,17.301039,,1,,,,,0,,,,
12111702,,Italy,8,,1,,1,17,2,3,1,0,,,72,2,176,2,,,,,,,,0,,,,
12111703,,Italy,8,,1,,1,6,,,1,0,,,30,2,119,2,,,,,,,,0,,,,
12111801,,Italy,8,,1,,2,45,2,3,1,0,,,64,2,165,2,23.507805,,2,,,,,0,,,,
12111901,,Italy,8,,1,,1,56,3,6,1,0,,,80,2,184,2,23.62949,,2,,,,,0,,,,
12111902,,Italy,8,,1,,2,48,2,3,1,0,,,49,2,155,2,20.395422,,2,,,,,0,,,,
12111903,,Italy,8,,1,,2,22,2,4,1,0,,,57,2,170,2,19.723183,,2,,,,,3,,,,
12112001,,Italy,8,,1,,1,57,2,3,1,0,,,75,2,170,2,25.951557,,3,,,,,0,,,,
12112002,,Italy,8,,1,,2,54,3,6,1,0,,,70,2,160,2,27.34375,,3,,,,,0,,,,
12112003,,Italy,8,,1,,1,26,2,4,1,0,,,62,2,180,2,19.135803,,2,,,,,0,,,,
12112101,,Italy,8,,1,,2,81,3,6,1,0,,,61,2,160,2,23.828125,,2,,,,,0,,,,
12112201,,Italy,8,,1,,2,50,3,6,1,0,,,62,2,166,2,22.499638,,2,,,,,0,,,,
12112202,,Italy,8,,1,,2,76,2,3,1,0,,,69,2,160,2,26.953125,,3,,,,,0,,,,
12112301,,Italy,8,,1,,1,45,2,3,1,0,,,80,2,172,2,27.041645,,3,,,,,0,,,,
12112302,,Italy,8,,1,,2,46,2,3,1,0,,,68,2,160,2,26.5625,,3,,,,,0,,,,
12112303,,Italy,8,,1,,1,20,2,3,1,0,,,76,2,180,2,23.456791,,2,,,,,0,,,,
12112304,,Italy,8,,1,,1,8,,,1,0,,,56,2,140,2,,,,,,,,0,,,,Potential outlier for weight
12112401,,Italy,8,,1,,1,41,1,2,1,0,,,85,2,180,2,26.234568,,3,,,,,0,,,,
12112402,,Italy,8,,1,,2,39,2,3,1,0,,,65,2,160,2,25.390625,,3,,,,,0,,,,
12112403,,Italy,8,,1,,1,17,2,3,1,0,,,55,2,165,2,,,,,,,,0,,,,
12112501,,Italy,8,,1,,1,75,1,2,1,0,,,80,2,176,2,25.826447,,3,,,,,0,,,,
12112502,,Italy,8,,1,,2,73,2,3,1,0,,,72,2,160,2,28.125,,3,,,,,0,,,,
12112601,,Italy,8,,1,,1,65,2,3,1,0,,,85,2,170,2,29.411764,,3,,,,,0,,,,
12112701,,Italy,8,,1,,1,49,2,3,1,0,,,110,2,185,2,32.140247,,4,,,,,0,,,,Potential outlier for weight
12112702,,Italy,8,,1,,2,48,2,4,1,0,,,70,2,175,2,22.857143,,2,,,,,0,,,,
12112703,,Italy,8,,1,,1,20,2,4,1,0,,,85,2,186,2,24.569315,,2,,,,,0,,,,
12112704,,Italy,8,,1,,2,19,2,3,1,0,,,55,2,165,2,,,,,,,,0,,,,
12112801,,Italy,8,,1,,1,32,2,4,1,0,,,85,2,190,2,23.545706,,2,,,,,0,,,,
12112901,,Italy,8,,1,,1,52,2,3,1,0,,,70,2,170,2,24.221453,,2,,,,,0,,,,
12112902,,Italy,8,,1,,2,49,2,3,1,0,,,60,2,157,2,24.341759,,2,,,,,0,,,,
12112903,,Italy,8,,1,,2,30,2,4,1,0,,,45,2,160,2,17.578125,,1,,,,,0,,,,
12113001,,Italy,8,,1,,2,48,2,3,1,0,,,67,2,160,2,26.171875,,3,,,,,0,,,,
12113002,,Italy,8,,1,,1,56,2,3,1,0,,,107,2,190,2,29.639889,,3,,,,,0,,,,Potential outlier for weight
12113003,,Italy,8,,1,,1,23,2,4,1,0,,,83,2,185,2,24.251278,,2,,,,,0,,,,
12113101,,Italy,8,,1,,2,68,2,3,1,0,,,69,2,165,2,25.344353,,3,,,,,0,,,,
12113201,,Italy,8,,1,,1,44,2,3,1,0,,,95,2,175,2,31.020409,,4,,,,,0,,,,
12113202,,Italy,8,,1,,2,39,2,3,1,0,,,75,2,165,2,27.54821,,3,,,,,0,,,,
12113203,,Italy,8,,1,,1,15,2,3,1,0,,,75,2,185,2,,,,,,,,0,,,,
12113204,,Italy,8,,1,,2,8,,,1,0,,,35,2,142,2,,,,,,,,0,,,,
12113301,,Italy,8,,1,,2,55,2,4,1,0,,,68,2,168,2,24.09297,,2,,,,,0,,,,
12113401,,Italy,8,,1,,1,59,2,4,1,0,,,65,2,166,2,23.588329,,2,,,,,0,,,,
12113402,,Italy,8,,1,,2,58,2,3,1,0,,,60,2,160,2,23.4375,,2,,,,,0,,,,
12113501,,Italy,8,,1,,2,49,2,4,1,0,,,63,2,168,2,22.321428,,2,,,,,0,,,,
12113502,,Italy,8,,1,,2,12,,,1,0,,,57,2,165,2,,,,,,,,0,,,,
12113601,,Italy,8,,1,,2,39,2,3,1,1,,,80,2,165,2,29.384756,,3,,,,,0,,,,
12113602,,Italy,8,,1,,1,39,2,4,1,0,,,69,2,176,2,22.275311,,2,,,,,0,,,,
12113603,,Italy,8,,1,,2,17,2,4,1,0,,,55,2,168,2,,,,,,,,0,,,,
12113701,,Italy,8,,1,,1,57,2,3,1,0,,,84,2,164,2,31.231409,,4,,,,,0,,,,
12113702,,Italy,8,,1,,2,56,2,3,1,0,,,63,2,158,2,25.23634,,3,,,,,0,,,,
13360101,,Italy,6,,1,,2,31,3,7,1,0,,,51,2,162,2,19.433014,,2,,,,,0,,,,
13360102,,Italy,6,,1,,1,36,2,3,1,0,,,69,2,179,2,21.534908,,2,,,,,0,,,,
13360201,,Italy,6,,1,,2,75,1,2,1,0,,,56,2,165,2,20.56933,,2,,,,,0,,,,
13360301,,Italy,6,,1,,1,48,1,2,1,0,,,74,2,170,2,25.605536,,3,,,,,0,,,,
13360302,,Italy,6,,1,,2,39,2,3,1,0,,,61,2,165,2,22.405876,,2,,,,,,,,,
13360303,,Italy,6,,1,,1,17,2,3,1,0,,,80,2,180,2,,,,,,,,0,,,,
13360304,,Italy,6,,1,,1,13,,,1,0,,,65,2,170,2,,,,,,,,0,,,,
13360401,,Italy,6,,1,,2,62,2,3,1,0,,,60,2,158,2,24.034611,,2,,,,,0,,,,
13360501,,Italy,6,,1,,1,47,1,2,1,0,,,61,2,165,2,22.405876,,2,,,,,0,,,,
13360502,,Italy,6,,1,,2,65,2,4,1,0,,,54,2,154,2,22.769438,,2,,,,,,,,,
13360701,,Italy,6,,1,,2,66,3,5,1,0,,,54,2,160,2,21.09375,,2,,,,,0,,,,
13360702,,Italy,6,,1,,1,67,3,5,1,0,,,62,2,180,2,19.135803,,2,,,,,0,,,,
13360801,,Italy,6,,1,,2,40,2,4,1,0,,,55,2,165,2,20.202021,,2,,,,,0,,,,
13360802,,Italy,6,,1,,1,15,2,3,1,0,,,45,2,168,2,,,,,,,,0,,,,
13360803,,Italy,6,,1,,2,13,,,1,0,,,48,2,165,2,,,,,,,,0,,,,
13360804,,Italy,6,,1,,1,10,,,1,0,,,30,2,146,2,,,,,,,,0,,,,
13360901,,Italy,6,,1,,1,41,2,3,1,0,,,67,2,170,2,23.183392,,2,,,,,0,,,,
13360902,,Italy,6,,1,,2,34,2,4,1,0,,,76,2,171,2,25.990904,,3,,,,,0,,,,
13360903,,Italy,6,,1,,1,3,,,1,0,,,17,2,105,2,,,,,,,,0,,,,
13360904,,Italy,6,,1,,1,.57999998,,,1,0,,,10,2,75,2,,,,,,,,0,,,,
13361001,,Italy,6,,1,,2,57,3,5,1,0,,,64,2,163,2,24.088223,,2,,,,,0,,,,
13361101,,Italy,6,,1,,2,84,2,4,1,0,,,68,2,150,2,30.222221,,4,,,,,0,,,,
13361102,,Italy,6,,1,,2,54,3,6,1,0,,,58,2,150,2,25.777779,,3,,,,,0,,,,
13361201,,Italy,6,,1,,2,49,2,4,1,0,,,53,2,167,2,19.003908,,2,,,,,0,,,,
13361202,,Italy,6,,1,,2,25,3,6,1,0,,,57,2,172,2,19.267172,,2,,,,,0,,,,
13361301,,Italy,6,,1,,1,75,2,3,1,0,,,80,2,172,2,27.041645,,3,,,,,0,,,,
13361401,,Italy,6,,1,,1,74,3,6,1,0,,,78,2,174,2,25.762981,,3,,,,,0,,,,
13361402,,Italy,6,,1,,1,69,2,4,1,0,,,60,2,163,2,22.582708,,2,,,,,0,,,,
13361501,,Italy,6,,1,,2,70,2,3,1,0,,,58,2,155,2,24.14152,,2,,,,,0,,,,
13361502,,Italy,6,,1,,1,76,2,4,1,0,,,62,2,172,2,20.957273,,2,,,,,0,,,,
13361601,,Italy,6,,1,,1,55,3,6,1,0,,,73,2,168,2,25.864513,,3,,,,,0,,,,
13361602,,Italy,6,,1,,2,51,3,6,1,0,,,63,2,160,2,24.609375,,2,,,,,0,,,,
13361701,,Italy,6,,1,,1,35,2,3,1,0,,,84,2,184,2,24.810965,,2,,,,,0,,,,
13361702,,Italy,6,,1,,2,31,2,4,1,0,,,46,2,161,2,17.746229,,1,,,,,0,,,,
13361801,,Italy,6,,1,,1,43,3,6,1,0,,,69,2,182,2,20.830818,,2,,,,,0,,,,
13361802,,Italy,6,,1,,2,44,2,4,1,0,,,62,2,169,2,21.707924,,2,,,,,0,,,,
13361803,,Italy,6,,1,,2,14,,,1,0,,,56,2,170,2,,,,,,,,0,,,,
13361804,,Italy,6,,1,,2,10,,,1,0,,,25,2,137,2,,,,,,,,0,,,,
13361805,,Italy,6,,1,,1,7,,,1,0,,,25,2,134,2,,,,,,,,0,,,,
13361901,,Italy,6,,1,,2,63,2,4,1,0,,,52,2,168,2,18.424036,,1,,,,,0,,,,
13361902,,Italy,6,,1,,1,65,2,4,1,0,,,70,2,169,2,24.508945,,2,,,,,0,,,,
13361903,,Italy,6,,1,,1,59,3,6,1,0,,,68,2,172,2,22.985397,,2,,,,,0,,,,
13362001,,Italy,6,,1,,1,44,2,3,1,0,,,69,2,180,2,21.296297,,2,,,,,0,,,,
13362002,,Italy,6,,1,,2,43,2,4,1,0,,,60,2,160,2,23.4375,,2,,,,,3,,,,
13362003,,Italy,6,,1,,2,14,,,1,0,,,49,2,160,2,,,,,,,,0,,,,
13362004,,Italy,6,,1,,1,12,,,1,0,,,43,2,164,2,,,,,,,,0,,,,
13362101,,Italy,6,,1,,1,66,3,6,1,0,,,61,2,178,2,19.252619,,2,,,,,0,,,,
13362201,,Italy,6,,1,,2,67,2,4,1,0,,,54,2,163,2,20.324438,,2,,,,,0,,,,
13362202,,Italy,6,,1,,1,39,2,4,1,0,,,84,2,184,2,24.810965,,2,,,,,0,,,,
13362301,,Italy,6,,1,,2,67,2,4,1,0,,,54,2,155,2,22.476587,,2,,,,,0,,,,
13362302,,Italy,6,,1,,1,43,3,7,1,0,,,70,2,170,2,24.221453,,2,,,,,0,,,,
13362401,,Italy,6,,1,,1,37,2,4,1,0,,,89,2,181,2,27.166449,,3,,,,,0,,,,
13362402,,Italy,6,,1,,2,43,2,3,1,0,,,59,2,158,2,23.634033,,2,,,,,0,,,,
13362403,,Italy,6,,1,,1,4,,,1,0,,,19,2,110,2,,,,,,,,0,,,,
13362501,,Italy,6,,1,,2,44,2,4,1,0,,,55,2,160,2,21.484375,,2,,,,,0,,,,
13362502,,Italy,6,,1,,1,47,2,4,1,0,,,95,2,186,2,27.459822,,3,,,,,,,,,
13362503,,Italy,6,,1,,1,13,,,1,0,,,70,2,175,2,,,,,,,,0,,,,
13362504,,Italy,6,,1,,2,10,,,1,0,,,25,2,130,2,,,,,,,,0,,,,
13362505,,Italy,6,,1,,1,4,,,1,0,,,21,2,116,2,,,,,,,,0,,,,
13362601,,Italy,6,,1,,1,47,2,4,1,0,,,88,2,175,2,28.734694,,3,,,,,0,,,,
13362602,,Italy,6,,1,,2,44,2,4,1,0,,,55,2,172,2,18.591131,,2,,,,,0,,,,
13362701,,Italy,6,,1,,1,58,3,6,1,0,,,92,2,193,2,24.69865,,2,,,,,0,,,,
13362702,,Italy,6,,1,,2,57,2,4,1,0,,,62,2,165,2,22.773186,,2,,,,,0,,,,
13362801,,Italy,6,,1,,1,72,2,4,1,0,,,76,2,177,2,24.258675,,2,,,,,0,,,,
13362802,,Italy,6,,1,,2,60,2,3,1,0,,,90,2,165,2,33.05785,,4,,,,,0,,,,
13362803,,Italy,6,,1,,2,34,2,3,1,0,,,70,2,167,2,25.099501,,3,,,,,0,,,,
13362804,,Italy,6,,1,,1,41,2,3,1,0,,,98,2,177,2,31.280922,,4,,,,,0,,,,
13362901,,Italy,6,,1,,1,49,2,3,1,0,,,70,2,160,2,27.34375,,3,,,,,0,,,,
13362902,,Italy,6,,1,,1,43,3,5,1,0,,,76,2,182,2,22.944088,,2,,,,,0,,,,
13363001,,Italy,6,,1,,2,74,2,4,1,0,,,77,2,168,2,27.281746,,3,,,,,0,,,,
13363101,,Italy,6,,1,,2,38,3,6,1,0,,,46,2,153,2,19.650562,,2,,,,,0,,,,
14170101,,Italy,5,,1,,1,71,2,3,1,0,,,85,2,170,2,29.411764,,3,,,,,0,,,,
14170103,,Italy,5,,1,,1,31,2,4,1,0,,,95,2,190,2,26.31579,,3,,,,,0,,,,
14170201,,Italy,5,,1,,2,74,1,2,1,0,,,57,2,155,2,23.725286,,2,,,,,0,,,,
14170301,,Italy,5,,1,,1,55,1,2,1,0,,,88,2,178,2,27.774271,,3,,,,,0,,,,
14170302,,Italy,5,,1,,2,55,2,3,1,0,,,58,2,155,2,24.14152,,2,,,,,0,,,,
14170303,,Italy,5,,1,,1,32,2,4,1,0,,,60,2,175,2,19.591837,,2,,,,,0,,,,
14170401,,Italy,5,,1,,1,66,3,7,1,0,,,82,2,178,2,25.880571,,3,,,,,0,,,,
14170402,,Italy,5,,1,,2,65,3,6,1,0,,,76,2,165,2,27.91552,,3,,,,,0,,,,
14170501,,Italy,5,,1,,1,36,3,6,1,0,,,70,2,171,2,23.93899,,2,,,,,0,,,,
14170601,,Italy,5,,1,,1,51,2,3,1,0,,,80,2,170,2,27.681662,,3,,,,,0,,,,
14170602,,Italy,5,,1,,2,45,2,4,1,0,,,58,2,154,2,24.456064,,2,,,,,0,,,,
14170603,,Italy,5,,1,,1,21,2,4,1,0,,,71,2,177,2,22.662708,,2,,,,,0,,,,
14170604,,Italy,5,,1,,2,12,,,1,0,,,44,2,150,2,,,,,,,,0,,,,
14170701,,Italy,5,,1,,1,73,2,3,1,0,,,78,2,175,2,25.469387,,3,,,,,0,,,,
14170702,,Italy,5,,1,,2,72,2,4,1,0,,,75,2,170,2,25.951557,,3,,,,,0,,,,
14170801,,Italy,5,,1,,2,72,1,2,1,0,,,75,2,165,2,27.54821,,3,,,,,0,,,,
14170901,,Italy,5,,1,,1,46,2,4,1,0,,,65,2,175,2,21.224489,,2,,,,,0,,,,
14170902,,Italy,5,,1,,2,46,2,4,1,0,,,54,2,160,2,21.09375,,2,,,,,0,,,,
14170903,,Italy,5,,1,,1,11,,,1,0,,,32,2,145,2,,,,,,,,0,,,,
14171001,,Italy,5,,1,,2,31,2,4,1,0,,,56,2,165,2,20.56933,,2,,,,,0,,,,
14171002,,Italy,5,,1,,1,36,2,4,1,0,,,86,2,176,2,27.76343,,3,,,,,0,,,,
14171003,,Italy,5,,1,,2,1.67,,,1,0,,,11,2,85,2,,,,,,,,0,,,,
14171101,,Italy,5,,1,,1,61,2,3,1,0,,,77,2,180,2,23.765432,,2,,,,,0,,,,
14171102,,Italy,5,,1,,2,59,2,3,1,0,,,53,2,166,2,19.233561,,2,,,,,0,,,,
14171103,,Italy,5,,1,,2,25,3,5,1,0,,,53,2,170,2,18.3391,,1,,,,,0,,,,
14171201,,Italy,5,,1,,1,47,2,4,1,0,,,76,2,178,2,23.98687,,2,,,,,0,,,,
14171202,,Italy,5,,1,,2,45,2,4,1,0,,,67,2,160,2,26.171875,,3,,,,,0,,,,
14171203,,Italy,5,,1,,2,16,2,3,1,0,,,61,2,163,2,,,,,,,,0,,,,
14171301,,Italy,5,,1,,2,84,1,2,1,0,,,82,2,155,2,34.131115,,4,,,,,0,,,,
14171302,,Italy,5,,1,,2,48,2,4,1,0,,,75,2,160,2,29.296875,,3,,,,,0,,,,
14171303,,Italy,5,,1,,1,53,2,3,1,0,,,75,2,162,2,28.577961,,3,,,,,0,,,,
14171304,,Italy,5,,1,,1,19,2,3,1,0,,,70,2,175,2,,,,,,,,0,,,,
14171401,,Italy,5,,1,,2,59,2,4,1,0,,,70,2,160,2,27.34375,,3,,,,,0,,,,
14171501,,Italy,5,,1,,2,70,,,1,0,,,80,2,170,2,27.681662,,3,,,,,0,,,,
14171601,,Italy,5,,1,,2,35,3,7,1,0,,,50,2,162,2,19.051973,,2,,,,,0,,,,
14171701,,Italy,5,,1,,2,61,1,2,1,0,,,68,2,165,2,24.977043,,2,,,,,0,,,,
14171702,,Italy,5,,1,,1,68,1,2,1,0,,,70,2,170,2,24.221453,,2,,,,,0,,,,
14171801,,Italy,5,,1,,1,62,2,3,1,0,,,80,2,175,2,26.12245,,3,,,,,0,,,,
14171802,,Italy,5,,1,,2,55,2,3,1,0,,,79,2,164,2,29.372396,,3,,,,,0,,,,
14171803,,Italy,5,,1,,1,26,2,4,1,0,,,76,2,185,2,22.20599,,2,,,,,0,,,,
14171901,,Italy,5,,1,,1,36,2,4,1,0,,,69,2,175,2,22.530613,,2,,,,,0,,,,
14171902,,Italy,5,,1,,2,34,3,5,1,2,,,54,2,160,2,21.09375,,2,,,,,,,,,
14171903,,Italy,5,,1,,1,.5,,,1,0,,,6,2,67,2,,,,,,,,0,,,,
14172001,,Italy,5,,1,,1,36,3,6,1,0,,,82,2,178,2,25.880571,,3,,,,,0,,,,
14172002,,Italy,5,,1,,2,36,2,4,1,0,,,58,2,160,2,22.65625,,2,,,,,0,,,,
14172003,,Italy,5,,1,,2,7,,,1,0,,,23,2,123,2,,,,,,,,0,,,,
14172004,,Italy,5,,1,,2,5,,,1,0,,,22,2,112,2,,,,,,,,0,,,,
15140101,,Italy,6,,1,,2,54,2,4,1,0,,,50,2,156,2,20.545694,,2,,,,,0,,,,
15140102,,Italy,6,,1,,1,58,2,3,1,0,,,103,2,172,2,34.816116,,4,,,,,0,,,,
15140201,,Italy,6,,1,,1,57,3,6,1,0,,,96,2,178,2,30.299204,,4,,,,,0,,,,
15140202,,Italy,6,,1,,2,62,2,4,1,0,,,63,2,170,2,21.799309,,2,,,,,0,,,,
15140203,,Italy,6,,1,,1,33,2,4,1,0,,,76,2,185,2,22.20599,,2,,,,,0,,,,
15140204,,Italy,6,,1,,1,22,2,3,1,0,,,65,2,175,2,21.224489,,2,,,,,0,,,,
15140301,,Italy,6,,1,,2,33,2,4,1,0,,,59,2,160,2,23.046875,,2,,,,,0,,,,
15140302,,Italy,6,,1,,1,35,2,4,1,0,,,94,2,188,2,26.595745,,3,,,,,0,,,,
15140303,,Italy,6,,1,,2,.5,,,1,0,,,7,2,64,2,,,,,,,,0,,,,
15140401,,Italy,6,,1,,2,65,1,2,1,0,,,58,2,155,2,24.14152,,2,,,,,0,,,,
15140402,,Italy,6,,1,,1,67,2,3,1,0,,,88,2,172,2,29.745808,,3,,,,,0,,,,
15140501,,Italy,6,,1,,1,58,2,4,1,0,,,81,2,171,2,27.70083,,3,,,,,0,,,,
15140502,,Italy,6,,1,,2,57,1,2,1,0,,,56,2,151,2,24.560326,,2,,,,,0,,,,
15140503,,Italy,6,,1,,2,93,1,2,1,0,,,68,2,162,2,25.910685,,3,,,,,0,,,,
15140601,,Italy,6,,1,,2,76,1,2,1,0,,,53,2,160,2,20.703125,,2,,,,,0,,,,
15140701,,Italy,6,,1,,2,70,2,3,1,0,,,68,2,165,2,24.977043,,2,,,,,0,,,,
15140801,,Italy,6,,1,,2,74,1,2,1,0,,,85,2,155,2,35.379814,,4,,,,,0,,,,
15140802,,Italy,6,,1,,1,75,1,2,1,0,,,73,2,170,2,25.259516,,3,,,,,0,,,,
15140901,,Italy,6,,1,,2,50,2,3,1,0,,,68,2,157,2,27.587326,,3,,,,,0,,,,
15140902,,Italy,6,,1,,1,59,1,2,1,0,,,88,2,170,2,30.449827,,4,,,,,0,,,,
15140903,,Italy,6,,1,,2,33,2,3,1,0,,,68,2,150,2,30.222221,,4,,,,,0,,,,
15140904,,Italy,6,,1,,2,19,2,4,1,0,,,70,2,168,2,,,,,,,,0,,,,
15141001,,Italy,6,,1,,2,41,2,3,1,0,,,85,2,158,2,34.04903,,4,,,,,0,,,,
15141101,,Italy,6,,1,,2,55,2,3,1,0,,,54,2,150,2,24,,2,,,,,0,,,,
15141102,,Italy,6,,1,,1,57,2,3,1,0,,,70,2,170,2,24.221453,,2,,,,,0,,,,
15141103,,Italy,6,,1,,1,28,2,3,1,0,,,62,2,170,2,21.453287,,2,,,,,0,,,,
15141201,,Italy,6,,1,,2,25,3,6,1,0,,,60,2,168,2,21.258503,,2,,,,,0,,,,
15141202,,Italy,6,,1,,1,25,2,4,1,0,,,82,2,184,2,24.220226,,2,,,,,0,,,,
15141301,,Italy,6,,1,,1,66,2,3,1,0,,,72,2,169,2,25.209202,,3,,,,,0,,,,
15141302,,Italy,6,,1,,2,59,2,3,1,0,,,55,2,150,2,24.444445,,2,,,,,0,,,,
15141401,,Italy,6,,1,,2,77,1,2,1,0,,,72,2,167,2,25.816629,,3,,,,,0,,,,
15141501,,Italy,6,,1,,2,50,2,4,1,0,,,64,2,166,2,23.225431,,2,,,,,0,,,,
15141502,,Italy,6,,1,,1,54,2,3,1,0,,,80,2,166,2,29.03179,,3,,,,,0,,,,
15141503,,Italy,6,,1,,2,24,2,4,1,0,,,49,2,157,2,19.879103,,2,,,,,0,,,,
15141601,,Italy,6,,1,,2,54,2,3,1,0,,,55,2,160,2,21.484375,,2,,,,,0,,,,
15141602,,Italy,6,,1,,1,55,2,4,1,0,,,95,2,185,2,27.757486,,3,,,,,0,,,,
15141603,,Italy,6,,1,,1,27,2,4,1,0,,,70,2,180,2,21.604939,,2,,,,,0,,,,
15141701,,Italy,6,,1,,2,40,2,4,1,0,,,65,2,165,2,23.875114,,2,,,,,0,,,,
15141702,,Italy,6,,1,,1,43,2,3,1,0,,,78,2,177,2,24.89706,,2,,,,,0,,,,