id,hh_id,country,sec_area,tert_area,round,smpl_weight,sex,age,edc_level,edc,residence,preg_lact,breastfeeding,hh_head,wgt,wgt_method,hgt,hgt_method,bmi_adults,bmi_children,bmi_cat,misrep,pa,pa_cat,smok,special_diet,special_diet_other,clin_diet,clin_diet_other,note,T1,T2,T3,T4,T5_1,T6_1,T7_1,T8_1,T5_2,T6_2,T7_2,T8_2,T5_3,T6_3,T7_3,T8_3,T5_4,T6_4,T7_4,T8_4,T5_5,T6_5,T7_5,T8_5,T5_6,T6_6,T7_6,T8_6,T5_7,T6_7,T7_7,T8_7,T5_8,T6_8,T7_8,T8_8
101,,Israel,4,,1,1.005035780508122,2,77,3,,2,,,,54,1,152.6305,1,23.17987587128416,,2,,,,3,0,,,,,2,,1,1,1,2,3,4,2,,,,2,,,,1,2,2,4,2,,,,2,,,,1,2,2,2,2,,,
102,,Israel,4,,1,1.422714297811608,2,67,2,,2,,,,63,1,159.4443333333333,1,24.78120221055278,,2,,,,1,0,,,,,2,,1,3,2,,,,2,,,,2,,,,2,,,,2,,,,2,,,,1,3,1,2,2,,,
103,,Israel,4,,1,1.422714297811608,2,66,2,,2,,,,55,1,157.1773333333333,1,22.26295748523824,,2,,,,2,0,,,,,2,,1,1,1,1,3,2,2,,,,2,,,,2,,,,2,,,,2,,,,2,,,,2,,,
105,,Israel,4,,1,.8546324488038278,1,70,2,,2,,,,70,1,161.7716666666667,1,26.74811121495137,,3,,,,1,0,,,,,1,1,,,1,1,2,2,2,,,,2,,,,2,,,,2,,,,2,,,,2,,,,2,,,
106,,Israel,4,,1,1.005035780508122,2,76,2,,2,,,,56.25,1,152.8136666666667,1,24.08785531210957,,2,,,,1,,,3,,,2,,2,,,,,,,,,,,,,,,,,,,,,,,,,,,,,,,,,
107,,Israel,4,,1,1.005035780508122,2,71,3,,2,,,,84,1,151.7778333333333,1,36.46385562701591,,4,,,,2,,,3,,,1,1,,,1,1,2,4,2,,,,2,,,,2,,,,2,,,,2,,,,2,,,,2,,,
108,,Israel,4,,1,.9607733779141106,1,84,3,,2,,,,70,1,170.868,1,23.9759910530567,,2,,,,2,0,,,,,2,,1,1,2,,,,2,,,,2,,,,2,,,,2,,,,2,,,,2,,,,1,1,4,4
109,,Israel,4,,1,1.437566324902724,2,81,1,,2,,,,65,1,158.4393333333333,1,25.89329647291665,,3,,,,3,,,3,,,2,,2,,,,,,,,,,,,,,,,,,,,,,,,,,,,,,,,,
110,,Israel,2,,1,1.005035780508122,2,73,3,,2,,,,88,1,151.3016666666667,1,38.44105056420263,,4,,,,3,,,2,,,2,,2,,,,,,,,,,,,,,,,,,,,,,,,,,,,,,,,,
111,,Israel,2,,1,.8546324488038278,1,73,1,,2,,,,66.75,1,161.0448333333333,1,25.7369854776665,,3,,,,2,0,,,,,2,,2,,,,,,,,,,,,,,,,,,,,,,,,,,,,,,,,,
113,,Israel,1,,1,1.437566324902724,2,96,3,,2,,,,,,,,,,,,,,,,,6,,,,,,,,,,,,,,,,,,,,,,,,,,,,,,,,,,,,,,
114,,Israel,1,,1,1.437566324902724,2,84,3,,2,,,,46.5,1,151.8815,1,20.15780304865456,,2,,,,3,0,,,,,1,1,,,2,,,,2,,,,2,,,,1,1,2,4,2,,,,2,,,,2,,,,2,,,
115,,Israel,1,,1,1.576994433673469,1,67,3,,2,,,,,,,,,,,,,,2,,,2,,,2,,2,,,,,,,,,,,,,,,,,,,,,,,,,,,,,,,,,
116,,Israel,1,,1,.8546324488038278,1,79,3,,2,,,,92,1,168.3423333333333,1,32.46393367263029,,4,,,,1,0,,,,,1,1,,,2,,,,2,,,,2,,,,2,,,,2,,,,1,1,2,4,2,,,,2,,,
117,,Israel,1,,1,1.005035780508122,2,77,1,,2,,,,,,,,,,,,,,,,,,,,2,,2,,,,,,,,,,,,,,,,,,,,,,,,,,,,,,,,,
118,,Israel,5,,1,1.005035780508122,2,79,1,,2,,,,70,1,156.5641666666667,1,28.55704714454433,,3,,,,3,0,,,,,2,,1,2,1,1,3,4,2,,,,2,,,,1,1,3,,2,,,,1,2,3,3,,,,,,,,
119,,Israel,5,,1,.8546324488038278,1,79,2,,2,,,,65,1,158.0866666666667,1,26.00895313707535,,3,,,,3,0,,,,,2,,1,1,1,1,,4,2,,,,2,,,,2,,,,2,,,,2,,,,2,,,,2,,,
120,,Israel,5,,1,.9607733779141106,1,88,2,,2,,,,63,1,161.7016666666667,1,24.09414707400379,,2,,,,2,0,,,,,2,,2,,,,,,,,,,,,,,,,,,,,,,,,,,,,,,,,,
121,,Israel,5,,1,.8546324488038278,1,71,2,,2,,,,87,1,171.0041666666667,1,29.75129454836541,,3,,,,2,0,,,,,2,,2,,,,,,,,,,,,,,,,,,,,,,,,,,,,,,,,,
122,,Israel,5,,1,.9607733779141106,1,80,2,,2,,,,89,1,160.6766666666667,1,34.47342072987042,,4,,,,2,5,,6,,,2,,1,1,2,,,,2,,,,2,,,,2,,,,2,,,,2,,,,2,,,,1,1,3,
124,,Israel,5,,1,1.005035780508122,2,75,2,,2,,,,85,1,160.7725,1,32.88481443953129,,4,,,,3,0,,,,,2,,1,1,,,,,,,,,,,,,,,,,,,,,,,,,1,1,1,,2,,,
126,,Israel,5,,1,1.005035780508122,2,73,2,,2,,,,,,158.115,1,,,,,,,3,0,,,,,2,,2,,,,,,,,,,,,,,,,,,,,,,,,,,,,,,,,,
127,,Israel,5,,1,.9607733779141106,1,94,3,,2,,,,78,1,170,1,26.98961937716263,,3,,,,2,0,,,,,2,,2,,,,,,,,,,,,,,,,,,,,,,,,,,,,,,,,,
128,,Israel,5,,1,.9607733779141106,1,95,1,,2,,,,,,165.7553333333333,1,,,,,,,2,0,,,,,2,,2,,,,,,,,,,,,,,,,,,,,,,,,,,,,,,,,,
129,,Israel,5,,1,1.437566324902724,2,82,2,,2,,,,80,1,155.7033333333334,1,32.99849756328162,,4,,,,3,0,,,,,2,,2,,,,,,,,,,,,,,,,,,,,,,,,,,,,,,,,,
130,,Israel,5,,1,1.576994433673469,1,66,2,,2,,,,85,1,,,,,,,,,2,5,,6,,,2,,2,,,,,,,,,,,,,,,,,,,,,,,,,,,,,,,,,
131,,Israel,5,,1,.8546324488038278,1,73,3,,2,,,,64,1,,,,,,,,,2,0,,,,,1,1,,,1,,,,2,,,,1,,,,2,,,,2,,,,2,,,,1,1,3,3,2,,,
132,,Israel,5,,1,1.422714297811608,2,68,3,,2,,,,58,1,158.245,1,23.16157029939766,,2,,,,2,5,,6,,,1,1,,,1,1,2,3,2,,,,2,,,,2,,,,2,,,,2,,,,1,2,,,2,,,
133,,Israel,5,,1,1.437566324902724,2,81,2,,2,,,,,,147.3325,1,,,,,,,3,0,,,,,1,1,,,1,1,3,4,2,,,,2,,,,1,1,1,1,2,,,,2,,,,2,,,,2,,,
134,,Israel,5,,1,1.576994433673469,1,66,2,,2,,,,85,1,162.89,1,32.03539469402131,,4,,,,2,0,,,,,2,,2,,,,,,,,,,,,,,,,,,,,,,,,,,,,,,,,,
135,,Israel,5,,1,1.422714297811608,2,69,3,,2,,,,58.25,1,162.155,1,22.15313737280948,,2,,,,3,0,,,,,1,2,,,2,,,,2,,,,2,,,,2,,,,2,,,,1,3,4,3,1,3,4,3,2,,,
136,,Israel,4,,1,1.576994433673469,1,69,3,,2,,,,78.75,1,167.7346666666666,1,27.99012916100159,,3,,,,3,0,,,,,1,1,,,1,1,2,4,2,,,,1,3,2,4,1,1,2,4,2,,,,1,2,2,4,2,,,,2,,,
137,,Israel,4,,1,.8546324488038278,1,71,2,,2,,,,88,1,169.8503333333333,1,30.50351345464491,,4,,,,3,0,,,,,1,2,,,2,,,,2,,,,2,,,,1,2,2,4,2,,,,1,2,2,4,2,,,,2,,,
138,,Israel,4,,1,1.005035780508122,2,70,2,,2,,,,78,1,150.579,1,34.40058162164168,,4,,,,2,0,,,,,2,,2,,,,,,,,,,,,,,,,,,,,,,,,,,,,,,,,,
139,,Israel,4,,1,.9607733779141106,1,82,3,,2,,,,62,1,162.4343333333333,1,23.49827753199129,,2,,,,2,,,2,,,2,,2,,,,,,,,,,,,,,,,,,,,,,,,,,,,,,,,,
140,,Israel,4,,1,.8546324488038278,1,73,2,,2,,,,,,160.3726666666667,1,,,,,,,1,0,,,,,2,,1,1,2,,,,2,,,,2,,,,2,,,,2,,,,2,,,,1,1,1,1,2,,,
141,,Israel,4,,1,1.422714297811608,2,65,1,,2,,,,67,1,156.7148333333334,1,27.28064237537129,,3,,,,,,,,,,,,,,,,,,,,,,,,,,,,,,,,,,,,,,,,,,,,,
142,,Israel,4,,1,1.005035780508122,2,70,2,,2,,,,77,1,157.8413333333333,1,30.90645852219854,,4,,,,3,,,3,,,2,,2,,,,,,,,,,,,,,,,,,,,,,,,,,,,,,,,,
143,,Israel,4,,1,.8546324488038278,1,78,3,,2,,,,83.75,1,167.5228333333333,1,29.8426095200619,,3,,,,3,5,,6,,,2,,1,1,2,,,,2,,,,2,,,,2,,,,2,,,,2,,,,2,,,,1,1,2,4
144,,Israel,6,,1,1.437566324902724,2,87,3,,2,,,,68,1,153.0151666666667,1,29.04289825402751,,3,,,,3,0,,,,,2,,2,,,,,,,,,,,,,,,,,,,,,,,,,,,,,,,,,
145,,Israel,6,,1,1.005035780508122,2,79,2,,2,,,,45,1,155.136,1,,,,,,,1,0,,,,,1,1,,,1,2,2,3,2,,,,2,,,,2,,,,2,,,,2,,,,1,2,2,4,2,,,
146,,Israel,6,,1,.8546324488038278,1,70,2,,2,,,,88,1,162.7255,1,33.2331450308098,,4,,,,3,5,,3,,,1,2,,,1,2,3,2,2,,,,2,,,,2,,,,2,,,,2,,,,2,,,,2,,,
147,,Israel,6,,1,1.422714297811608,2,68,1,,2,,,,76,1,151.554,1,33.08862997527037,,4,,,,2,0,,,,,2,,2,,,,,,,,,,,,,,,,,,,,,,,,,,,,,,,,,
148,,Israel,6,,1,1.422714297811608,2,69,1,,2,,,,84,1,156.4745,1,34.30774244659956,,4,,,,3,5,,6,,,2,,2,,,,,,,,,,,,,,,,,,,,,,,,,,,,,,,,,
150,,Israel,6,,1,1.005035780508122,2,72,1,,2,,,,60,1,151.9343333333333,1,25.99198221938783,,3,,,,3,0,,,,,1,2,,,1,2,2,4,2,,,,2,,,,2,,,,2,,,,2,,,,2,,,,2,,,
151,,Israel,6,,1,.9607733779141106,1,83,2,,2,,,,68,1,173.7503333333333,1,22.52462761620367,,2,,,,2,0,,,,,2,,2,,,,,,,,,,,,,,,,,,,,,,,,,,,,,,,,,
152,,Israel,5,,1,1.005035780508122,2,72,1,,2,,,,70,1,158.1541666666667,1,27.98573798206084,,3,,,,2,0,,,,,2,,2,,,,,,,,,,,,,,,,,,,,,,,,,,,,,,,,,
153,,Israel,5,,1,1.005035780508122,2,74,3,,2,,,,64,1,150.4983333333333,1,28.25638459654011,,3,,,,3,0,,,,,2,,2,,,,,,,,,,,,,,,,,,,,,,,,,,,,,,,,,
154,,Israel,5,,1,1.005035780508122,2,74,2,,2,,,,86,1,162.655,1,32.50600630440196,,4,,,,2,0,,,,,2,,2,,,,,,,,,,,,,,,,,,,,,,,,,,,,,,,,,
155,,Israel,5,,1,1.005035780508122,2,72,1,,2,,,,53.25,1,154.9375,1,22.18229741364371,,2,,,,3,0,,,,,2,,2,,,,,,,,,,,,,,,,,,,,,,,,,,,,,,,,,
156,,Israel,5,,1,1.005035780508122,2,78,2,,2,,,,69,1,156.0933333333333,1,28.31916088690074,,3,,,,2,0,,,,,1,1,,,2,,,,2,,,,2,,,,1,1,2,4,2,,,,2,,,,2,,,,2,,,
157,,Israel,5,,1,1.437566324902724,2,82,2,,2,,,,71,1,154.1433333333334,1,29.8819445878301,,3,,,,2,,,6,,,1,2,,,2,,,,2,,,,1,2,1,3,2,,,,2,,,,2,,,,2,,,,2,,,
158,,Israel,5,,1,.8546324488038278,1,76,3,,2,,,,70,1,170.6383333333334,1,24.04057433279715,,2,,,,2,0,,,,,1,1,,,1,1,3,4,2,,,,2,,,,2,,,,2,,,,2,,,,2,,,,2,,,
159,,Israel,1,,1,.8546324488038278,1,75,3,,2,,,,72,1,167.7633333333333,1,25.58223023167811,,3,,,,2,,,3,,,1,1,,,1,2,2,4,2,,,,2,,,,1,2,2,4,2,,,,2,,,,2,,,,2,,,
160,,Israel,1,,1,1.005035780508122,2,71,1,,2,,,,79,1,160.3655,1,30.71886787002669,,4,,,,3,5,,3,,,1,1,,,1,1,2,4,2,,,,2,,,,2,,,,2,,,,2,,,,2,,,,2,,,
161,,Israel,1,,1,1.005035780508122,2,73,3,,2,,,,73,1,152.0096666666667,1,31.59224194856047,,4,,,,3,5,,3,,,2,,2,,,,,,,,,,,,,,,,,,,,,,,,,,,,,,,,,
162,,Israel,1,,1,.8546324488038278,1,78,2,,2,,,,76.5,1,167.9726666666667,1,27.11341373777761,,3,,,,3,0,,,,,2,,1,1,1,1,2,4,2,,,,2,,,,2,,,,2,,,,2,,,,1,1,2,4,1,1,4,4
163,,Israel,1,,1,1.437566324902724,2,85,1,,2,,,,61,1,150.889,1,26.79258852862477,,3,,,,3,0,,,,,2,,1,1,1,1,1,3,2,,,,2,,,,2,,,,2,,,,2,,,,1,3,1,3,2,,,
164,,Israel,6,,1,1.422714297811608,2,69,2,,2,,,,61,1,146.3386666666667,1,28.48469984923509,,3,,,,3,,,3,,,2,,1,1,1,1,1,4,2,,,,2,,,,2,,,,2,,,,2,,,,,,,,,,,
165,,Israel,6,,1,1.576994433673469,1,67,1,,2,,,,84.90000000000001,1,177.5073333333333,1,26.94480784715856,,3,,,,2,0,,,,,2,,2,,,,,,,,,,,,,,,,,,,,,,,,,,,,,,,,,
166,,Israel,6,,1,1.422714297811608,2,66,3,,2,,,,65,1,166.7126666666667,1,23.38708854558797,,2,,,,3,,,6,,,1,1,,,1,1,2,4,2,,,,2,,,,2,,,,2,,,,2,,,,1,2,3,4,2,,,
167,,Israel,6,,1,.8546324488038278,1,75,1,,2,,,,70.2,1,167.1323333333333,1,25.1313697195777,,3,,,,2,0,,,,,1,1,,,1,1,2,3,2,,,,2,,,,2,,,,2,,,,1,1,1,2,2,,,,2,,,
168,,Israel,6,,1,1.422714297811608,2,68,3,,2,,,,57,1,150.7946666666667,1,25.06703067465956,,3,,,,3,,,6,,,1,1,,,1,1,2,4,2,,,,2,,,,2,,,,2,,,,2,,,,2,,,,2,,,
169,,Israel,6,,1,.8546324488038278,1,73,2,,2,,,,102,1,178.062,1,32.17049012998633,,4,,,,2,0,,,,,2,,2,,,,,,,,,,,,,,,,,,,,,,,,,,,,,,,,,
170,,Israel,6,,1,1.576994433673469,1,69,3,,2,,,,82,1,174.8251666666667,1,26.8290905040484,,3,,,,2,0,,,,,1,1,,,1,1,2,3,2,,,,2,,,,2,,,,2,,,,2,,,,2,,,,2,,,
171,,Israel,6,,1,1.005035780508122,2,73,2,,2,,,,78,1,159.8435,1,30.52844205734363,,4,,,,3,,,3,,,1,1,,,1,1,3,3,2,,,,2,,,,2,,,,2,,,,2,,,,2,,,,2,,,
172,,Israel,2,,1,.8546324488038278,1,71,2,,2,,,,112.15,1,176.22,1,36.11510518734507,,4,,,,2,5,,3,,,2,,2,,,,,,,,,,,,,,,,,,,,,,,,,,,,,,,,,
173,,Israel,2,,1,.9607733779141106,1,82,1,,2,,,,57.5,1,166.1355,1,,,,,,,1,,,,,,2,,2,,,,,,,,,,,,,,,,,,,,,,,,,,,,,,,,,
174,,Israel,2,,1,.9607733779141106,1,83,2,,2,,,,65.15000000000001,1,165.705,1,23.72701986797669,,2,,,,2,0,,,,,1,1,,,1,1,2,3,2,,,,2,,,,2,,,,2,,,,2,,,,2,,,,2,,,
175,,Israel,2,,1,1.422714297811608,2,67,3,,2,,,,68,1,163.6388333333333,1,25.3942951911076,,3,,,,3,,,3,,,1,1,,,1,1,2,1,2,,,,2,,,,1,2,1,1,2,,,,2,,,,2,,,,2,,,
176,,Israel,2,,1,1.005035780508122,2,72,1,,2,,,,102.5,1,157.8525,1,41.13589364846052,,4,,,,3,0,,,,,2,,2,,,,,,,,,,,,,,,,,,,,,,,,,,,,,,,,,
177,,Israel,2,,1,1.437566324902724,2,81,2,,2,,,,60,1,144.4935,1,28.737873487203,,3,,,,2,0,,,,,2,,2,,,,,,,,,,,,,,,,,,,,,,,,,,,,,,,,,
178,,Israel,2,,1,1.005035780508122,2,77,2,,2,,,,88,1,153.8451666666667,1,37.18047714792588,,4,,,,3,0,,,,,2,,2,,,,,,,,,,,,,,,,,,,,,,,,,,,,,,,,,
179,,Israel,2,,1,1.422714297811608,2,65,1,,2,,,,96,1,157.0838333333333,1,38.90525366723511,,4,,,,3,0,,,,,1,2,,,1,2,1,2,2,,,,2,,,,2,,,,2,,,,2,,,,2,,,,2,,,
180,,Israel,4,,1,1.005035780508122,2,71,2,,2,,,,85,1,157.6348333333334,1,34.20696488990241,,4,,,,3,,,6,,,1,2,,,1,2,2,4,2,,,,2,,,,2,,,,1,2,2,3,2,,,,2,,,,2,,,
181,,Israel,4,,1,1.005035780508122,2,77,2,,2,,,,58,1,152.3836666666667,1,24.97762578915623,,2,,,,3,,,6,,,2,,1,1,1,1,2,4,2,,,,2,,,,2,,,,2,,,,2,,,,1,1,1,3,2,,,
182,,Israel,4,,1,.8546324488038278,1,79,3,,2,,,,80,1,167.6283333333333,1,28.47050253515051,,3,,,,2,,,2,,,1,1,,,1,1,2,4,2,,,,2,,,,1,1,2,4,1,5,4,4,2,,,,2,,,,2,,,
183,,Israel,4,,1,1.576994433673469,1,67,3,,2,,,,69,1,163.5743333333333,1,25.78806598731945,,3,,,,3,,,2,,,1,1,,,1,1,3,3,2,,,,2,,,,2,,,,2,,,,2,,,,2,,,,2,,,
184,,Israel,4,,1,.8546324488038278,1,76,3,,2,,,,,,164.97,1,,,,,,,2,,,6,,,2,,2,,,,,,,,,,,,,,,,,,,,,,,,,,,,,,,,,
185,,Israel,4,,1,1.576994433673469,1,68,2,,2,,,,78.75,1,164.4996666666667,1,29.10184464293797,,3,,,,3,,,3,,,1,1,,,1,1,2,4,2,,,,2,,,,2,,,,2,,,,2,,,,1,1,1,4,2,,,
186,,Israel,4,,1,.9607733779141106,1,84,3,,2,,,,69,1,157.897,1,27.67587328594662,,3,,,,3,0,,,,,1,3,,,1,2,1,4,2,,,,2,,,,1,1,1,1,1,3,2,4,2,,,,2,,,,2,,,
187,,Israel,4,,1,1.576994433673469,1,67,2,,2,,,,93,1,164.945,1,34.18256419239063,,4,,,,1,5,,6,,,1,1,,,1,1,2,3,2,,,,1,1,2,3,2,,,,1,1,4,2,1,1,2,3,1,2,2,3,2,,,
188,,Israel,4,,1,.8546324488038278,1,77,3,,2,,,,67,1,162.2166666666667,1,25.46149245367072,,3,,,,3,0,,,,,1,1,,,1,1,2,4,2,,,,2,,,,2,,,,2,,,,2,,,,2,,,,2,,,
189,,Israel,3,,1,1.005035780508122,2,72,3,,2,,,,85,1,163.7433333333333,1,31.70236570541283,,4,,,,3,5,,6,,,1,1,,,1,1,2,4,2,,,,2,,,,2,,,,2,,,,1,1,2,4,2,,,,2,,,
190,,Israel,3,,1,.9607733779141106,1,80,3,,2,,,,70,1,168.7786666666667,1,24.57326910253534,,2,,,,3,5,,6,,,1,1,,,1,1,3,3,2,,,,2,,,,2,,,,2,,,,2,,,,2,,,,2,,,
191,,Israel,2,,1,1.437566324902724,2,89,1,,2,,,,,,156.14075,1,,,,,,,3,0,,,,,2,,2,,,,,,,,,,,,,,,,,,,,,,,,,,,,,,,,,
192,,Israel,2,,1,1.005035780508122,2,74,2,,2,,,,55,1,150.607,1,24.24780183147341,,2,,,,3,0,,,,,2,,2,,,,,,,,,,,,,,,,,,,,,,,,,,,,,,,,,
193,,Israel,2,,1,1.576994433673469,1,67,2,,2,,,,94.15000000000001,1,174.7053333333333,1,30.84664945023279,,4,,,,1,0,,,,,1,1,,,2,,,,2,,,,1,1,3,4,2,,,,2,,,,2,,,,2,,,,2,,,
194,,Israel,2,,1,1.576994433673469,1,65,1,,2,,,,67.5,1,166.955,1,24.21613968022198,,2,,,,3,0,,,,,1,1,,,2,,,,2,,,,1,1,2,2,2,,,,2,,,,2,,,,2,,,,2,,,
195,,Israel,3,,1,1.437566324902724,2,91,2,,2,,,,,,160.495,1,,,,,,,2,5,,6,,,2,,2,,,,,,,,,,,,,,,,,,,,,,,,,,,,,,,,,
196,,Israel,3,,1,1.005035780508122,2,71,2,,2,,,,93.5,1,160.0073333333334,1,36.52008974838884,,4,,,,2,0,,,,,1,1,,,1,1,2,3,2,,,,2,,,,2,,,,2,,,,2,,,,2,,,,2,,,
197,,Israel,3,,1,1.422714297811608,2,69,1,,2,,,,66,1,150.4703333333333,1,29.15024232808866,,3,,,,1,,,6,,,1,2,,,1,2,3,2,2,,,,2,,,,2,,,,2,,,,2,,,,2,,,,2,,,
198,,Israel,3,,1,1.005035780508122,2,79,3,,2,,,,44.25,1,153.6536666666667,1,18.74249563172858,,2,,,,3,0,,,,,1,2,,,1,1,2,2,2,,,,2,,,,2,,,,2,,,,2,,,,2,,,,2,,,
199,,Israel,3,,1,1.422714297811608,2,69,1,,2,,,,62.25,1,157.1906666666667,1,25.19334558489631,,3,,,,3,,,3,,,2,,2,,,,,,,,,,,,,,,,,,,,,,,,,,,,,,,,,
202,,Israel,1,,1,1.005035780508122,2,75,3,,2,,,,45,1,149.1621666666667,1,20.22530816691047,,2,,,,2,,,3,,,2,,2,,,,,,,,,,,,,,,,,,,,,,,,,,,,,,,,,
203,,Israel,1,,1,.9607733779141106,1,88,1,,2,,,,56,1,159.8126666666667,1,21.92631406105678,,2,,,,2,,,2,,,2,,1,1,1,1,1,4,2,,,,2,,,,2,,,,2,,,,2,,,,2,,,,2,,,
204,,Israel,1,,1,1.005035780508122,2,70,3,,2,,,,74.5,1,150.0271666666667,1,33.09912078833353,,4,,,,1,0,,,,,2,,1,2,2,,,,2,,,,2,,,,2,,,,2,,,,2,,,,1,2,1,4,2,,,
205,,Israel,1,,1,.8546324488038278,1,74,3,,2,,,,54.5,1,158.1966666666667,1,21.77719027086899,,2,,,,3,0,,,,,1,1,,,1,1,2,4,2,,,,2,,,,2,,,,2,,,,2,,,,2,,,,2,,,
206,,Israel,1,,1,.8546324488038278,1,76,2,,2,,,,49.5,1,163.2965,1,,,,,,,1,0,,,,,2,,1,1,1,1,1,3,2,,,,2,,,,2,,,,2,,,,2,,,,2,,,,2,,,
207,,Israel,1,,1,1.005035780508122,2,79,2,,2,,,,74,1,155.321,1,30.67406713394173,,4,,,,3,0,,,,,1,2,,,1,2,2,4,2,,,,2,,,,2,,,,2,,,,2,,,,1,2,2,4,2,,,
208,,Israel,1,,1,1.437566324902724,2,89,3,,2,,,,66.5,1,153.8595,1,28.0913759348719,,3,,,,3,0,,,,,2,,2,,,,,,,,,,,,,,,,,,,,,,,,,,,,,,,,,
209,,Israel,1,,1,.9607733779141106,1,84,3,,2,,,,,,157.8118333333333,1,,,,,,,2,0,,,,,2,,2,,,,,,,,,,,,,,,,,,,,,,,,,,,,,,,,,
210,,Israel,1,,1,1.005035780508122,2,72,3,,2,,,,79,1,164.8018333333334,1,29.08727346152357,,3,,,,3,0,,,,,2,,1,2,2,,,,2,,,,1,2,1,2,2,,,,2,,,,2,,,,1,3,2,3,2,,,
211,,Israel,4,,1,1.005035780508122,2,74,3,,2,,,,64,1,151.1823333333333,1,28.00128011618613,,3,,,,3,0,,,,,2,,1,1,1,1,2,4,2,,,,2,,,,2,,,,2,,,,2,,,,1,2,2,4,2,,,
212,,Israel,4,,1,1.005035780508122,2,79,1,,2,,,,53,1,152.0116666666667,1,22.93622964495255,,2,,,,3,0,,,,,2,,1,1,2,,,,2,,,,2,,,,2,,,,2,,,,2,,,,1,1,1,4,2,,,
213,,Israel,4,,1,1.576994433673469,1,67,2,,2,,,,80,1,168.405,1,28.20850198943238,,3,,,,2,,,1,,,1,3,,,2,,,,2,,,,2,,,,2,,,,1,3,4,,2,,,,2,,,,2,,,
214,,Israel,4,,1,.8546324488038278,1,72,2,,2,,,,,,162.237,1,,,,,,,2,0,,,,,2,,2,,,,,,,,,,,,,,,,,,,,,,,,,,,,,,,,,
216,,Israel,4,,1,.8546324488038278,1,71,1,,2,,,,70,1,169.9846666666666,1,24.2258232386179,,2,,,,2,0,,,,,2,,2,,,,,,,,,,,,,,,,,,,,,,,,,,,,,,,,,
217,,Israel,4,,1,.9607733779141106,1,85,2,,2,,,,53.25,1,151.7663333333333,1,23.11898316150885,,2,,,,1,0,,,,,1,1,,,1,2,4,4,2,,,,2,,,,2,,,,2,,,,1,2,1,4,2,,,,2,,,
218,,Israel,4,,1,1.576994433673469,1,66,3,,2,,,,79,1,167.5576666666667,1,28.13834067571008,,3,,,,3,,,1,,,2,,1,1,1,1,2,4,2,,,,2,,,,2,,,,2,,,,2,,,,2,,,,2,,,
219,,Israel,4,,1,.8546324488038278,1,78,1,,2,,,,,,165.3885,1,,,,,,,2,0,,,,,2,,2,,,,,,,,,,,,,,,,,,,,,,,,,,,,,,,,,
221,,Israel,4,,1,1.437566324902724,2,80,1,,2,,,,,,151.7015,1,,,,,,,2,0,,,,,2,,1,1,2,,,,2,,,,2,,,,2,,,,2,,,,2,,,,1,1,1,1,2,,,
222,,Israel,4,,1,1.005035780508122,2,72,1,,2,,,,89,1,153.9531666666667,1,37.55024318518955,,4,,,,2,5,,3,,,2,,2,,,,,,,,,,,,,,,,,,,,,,,,,,,,,,,,,
223,,Israel,4,,1,1.005035780508122,2,70,1,,2,,,,97,1,155.8753333333333,1,39.92242777305885,,4,,,,3,,,6,,,2,,2,,,,,,,,,,,,,,,,,,,,,,,,,,,,,,,,,
224,,Israel,4,,1,.8546324488038278,1,78,3,,2,,,,80,1,162.7513333333334,1,30.20235977252212,,4,,,,2,0,,,,,2,,1,1,1,1,3,4,2,,,,2,,,,2,,,,2,,,,2,,,,2,,,,2,,,
225,,Israel,5,,1,.8546324488038278,1,78,3,,2,,,,90,1,174.82,1,29.44830331375474,,3,,,,2,5,,1,,,2,,1,1,2,,,,2,,,,2,,,,2,,,,2,,,,1,2,2,4,2,,,,2,,,
226,,Israel,5,,1,1.437566324902724,2,83,2,,2,,,,59,1,153.92,1,24.90358681886749,,2,,,,3,0,,,,,2,,2,,,,,,,,,,,,,,,,,,,,,,,,,,,,,,,,,
227,,Israel,5,,1,1.576994433673469,1,68,2,,2,,,,83,1,164.055,1,30.83891926712857,,4,,,,2,0,,,,,2,,2,,,,,,,,,,,,,,,,,,,,,,,,,,,,,,,,,
228,,Israel,5,,1,1.005035780508122,2,73,,,2,,,,74,1,149.9833333333334,1,32.89619874915167,,4,,,,3,0,,,,,2,,2,,,,,,,,,,,,,,,,,,,,,,,,,,,,,,,,,
229,,Israel,5,,1,.8546324488038278,1,79,3,,2,,,,74,1,175.5666666666667,1,24.0075362035268,,2,,,,3,5,,6,,,2,,1,1,1,1,2,1,2,,,,2,,,,2,,,,2,,,,2,,,,2,,,,2,,,
230,,Israel,5,,1,.9607733779141106,1,80,2,,2,,,,88,1,162.6533333333333,1,33.26264159629339,,4,,,,2,0,,,,,2,,2,,,,,,,,,,,,,,,,,,,,,,,,,,,,,,,,,
231,,Israel,5,,1,.8546324488038278,1,79,3,,2,,,,98,1,177.5463333333333,1,31.08870702934604,,4,,,,2,0,,,,,2,,2,,,,,,,,,,,,,,,,,,,,,,,,,,,,,,,,,
232,,Israel,5,,1,1.005035780508122,2,72,1,,2,,,,56,1,149.55,1,25.03889692033864,,3,,,,1,0,,,,,2,,2,,,,,,,,,,,,,,,,,,,,,,,,,,,,,,,,,
233,,Israel,5,,1,1.437566324902724,2,95,2,,2,,,,60,1,150.7133333333333,1,26.4148348577103,,3,,,,3,0,,,,,2,,2,,,,,,,,,,,,,,,,,,,,,,,,,,,,,,,,,
234,,Israel,5,,1,1.005035780508122,2,72,2,,2,,,,58,1,152.1566666666667,1,25.05220879112251,,3,,,,3,0,,,,,2,,1,1,1,1,1,3,2,,,,2,,,,2,,,,2,,,,2,,,,1,2,2,3,2,,,
235,,Israel,5,,1,1.437566324902724,2,89,3,,2,,,,52,1,147.765,1,23.8155265162536,,2,,,,3,0,,,,,2,,2,,,,,,,,,,,,,,,,,,,,,,,,,,,,,,,,,
236,,Israel,5,,1,.9607733779141106,1,83,2,,2,,,,83,1,168.4416666666666,1,29.25358071648017,,3,,,,3,5,,3,,,2,,2,,,,,,,,,,,,,,,,,,,,,,,,,,,,,,,,,
237,,Israel,5,,1,1.005035780508122,2,79,2,,2,,,,56.25,1,158.2066666666667,1,22.47361653353298,,2,,,,2,,,6,,,1,1,,,1,1,3,4,2,,,,2,,,,2,,,,2,,,,2,,,,2,,,,2,,,
238,,Israel,5,,1,.8546324488038278,1,75,2,,2,,,,80.5,1,161,1,31.05590062111801,,4,,,,2,5,,6,,,1,,2,,,,,,,,,,,,,,,,,,,,,,,,,,,,,,,,,
239,,Israel,5,,1,1.005035780508122,2,78,2,,2,,,,52,1,146.905,1,24.09518075521713,,2,,,,2,0,,,,,2,,1,2,2,,,,2,,,,2,,,,2,,,,2,,,,2,,,,1,2,2,3,2,,,
240,,Israel,1,,1,1.437566324902724,2,90,2,,2,,,,,,,,,,,,,,3,0,,,,,2,,1,1,2,,,,2,,,,2,,,,2,,,,2,,,,2,,,,1,1,1,4,2,,,
241,,Israel,1,,1,.8546324488038278,1,78,3,,2,,,,75,1,160.2546666666667,1,29.20383547200288,,3,,,,2,0,,,,,1,5,1,1,1,1,3,2,2,,,,1,5,1,3,2,,,,2,,,,2,,,,2,,,,2,,,
242,,Israel,1,,1,.8546324488038278,1,74,3,,2,,,,78,1,166.922,1,27.99416019021137,,3,,,,2,5,,6,,,1,2,,,1,2,2,3,2,,,,2,,,,2,,,,2,,,,2,,,,2,,,,2,,,
243,,Israel,1,,1,.8546324488038278,1,78,3,,2,,,,99,1,168.7108333333333,1,34.78157574666879,,4,,,,2,0,,,,,2,,1,1,1,1,2,4,2,,,,2,,,,2,,,,2,,,,2,,,,1,1,1,2,2,,,
244,,Israel,6,,1,.9607733779141106,1,81,2,,2,,,,62,1,174.0361666666667,1,20.46975627138851,,2,,,,2,0,,,,,1,1,,,1,1,2,4,2,,,,2,,,,2,,,,2,,,,1,1,2,4,2,,,,2,,,
245,,Israel,6,,1,.8546324488038278,1,73,3,,2,,,,,,163.211,1,,,,,,,1,0,,,,,1,1,,,1,1,2,4,2,,,,2,,,,2,,,,2,,,,2,,,,2,,,,2,,,
247,,Israel,6,,1,1.422714297811608,2,68,1,,2,,,,70,1,162.6518333333333,1,26.45940747022392,,3,,,,3,,,6,,,1,2,,,2,,,,2,,,,2,,,,2,,,,2,,,,2,,,,1,2,3,4,2,,,
248,,Israel,6,,1,.8546324488038278,1,72,2,,2,,,,70,1,175.68,1,,,,,,,2,0,,,,,1,1,,,2,,,,2,,,,2,,,,1,1,4,4,2,,,,1,1,3,4,2,,,,2,,,
249,,Israel,6,,1,.8546324488038278,1,72,3,,2,,,,81,1,170.244,1,27.947398613657,,3,,,,2,,,3,,,1,1,,,1,1,3,4,2,,,,2,,,,2,,,,2,,,,2,,,,2,,,,2,,,
250,,Israel,6,,1,.8546324488038278,1,75,3,,2,,,,90,1,166.6826666666667,1,32.39378009568055,,4,,,,2,,,6,,,2,,2,,,,,,,,,,,,,,,,,,,,,,,,,,,,,,,,,
251,,Israel,6,,1,.8546324488038278,1,71,2,,2,,,,85.05,1,163.7298333333334,1,31.7262453508634,,4,,,,3,,,2,,,1,1,,,1,1,2,4,2,,,,2,,,,2,,,,2,,,,2,,,,2,,,,2,,,
252,,Israel,6,,1,.8546324488038278,1,74,2,,2,,,,,,161.52,1,,,,,,,2,5,,2,,,1,1,,,1,1,4,4,2,,,,2,,,,2,,,,2,,,,2,,,,2,,,,2,,,
253,,Israel,6,,1,1.005035780508122,2,79,2,,2,,,,64,1,154.5,1,,,,,,,3,0,,,,,2,,2,,,,,,,,,,,,,,,,,,,,,,,,,,,,,,,,,
254,,Israel,6,,1,1.005035780508122,2,76,1,,2,,,,72,1,161.943,1,,,,,,,2,5,,3,,,1,2,,,2,,,,2,,,,2,,,,2,,,,2,,,,2,,,,1,2,3,4,2,,,
255,,Israel,6,,1,1.005035780508122,2,72,2,,2,,,,82,1,162.2206666666667,1,31.1602898416876,,4,,,,1,0,,,,,2,,2,,,,,,,,,,,,,,,,,,,,,,,,,,,,,,,,,
256,,Israel,6,,1,.8546324488038278,1,74,1,,2,,,,83,1,166.1243333333333,1,30.07541232945544,,4,,,,2,,,6,,,2,,2,,,,,,,,,,,,,,,,,,,,,,,,,,,,,,,,,
257,,Israel,6,,1,.8546324488038278,1,71,1,,2,,,,91,1,171.7873333333333,1,30.83607661265485,,4,,,,2,,,6,,,2,,2,,,,,,,,,,,,,,,,,,,,,,,,,,,,,,,,,
258,,Israel,6,,1,.8546324488038278,1,76,2,,2,,,,75,1,177.65775,1,,,,,,,3,,,3,,,1,1,,,1,1,2,3,2,,,,2,,,,2,,,,2,,,,2,,,,2,,,,2,,,
259,,Israel,6,,1,1.437566324902724,2,81,2,,2,,,,74,1,159.14525,1,,,,,,,3,,,3,,,2,,2,,,,,,,,,,,,,,,,,,,,,,,,,,,,,,,,,
260,,Israel,6,,1,1.422714297811608,2,67,3,,2,,,,64,1,155.166,1,26.58195048224583,,3,,,,3,0,,,,,2,,2,,,,,,,,,,,,,,,,,,,,,,,,,,,,,,,,,
261,,Israel,6,,1,.9607733779141106,1,80,2,,2,,,,65,1,161.5998333333333,1,24.89038072099052,,2,,,,3,0,,,,,1,1,,,2,,,,2,,,,2,,,,2,,,,2,,,,1,1,1,4,2,,,,2,,,
262,,Israel,6,,1,.8546324488038278,1,71,1,,2,,,,,,158.49525,1,,,,,,,3,0,,,,,2,,2,,,,,,,,,,,,,,,,,,,,,,,,,,,,,,,,,
263,,Israel,6,,1,1.005035780508122,2,75,2,,2,,,,,,,,,,,,,,3,0,,,,,2,,2,,,,,,,,,,,,,,,,,,,,,,,,,,,,,,,,,
264,,Israel,6,,1,1.437566324902724,2,80,2,,2,,,,64,1,160.0193333333333,1,24.99395942820902,,2,,,,3,,,6,,,1,2,,,2,,,,2,,,,2,,,,2,,,,2,,,,2,,,,1,2,3,4,2,,,
265,,Israel,6,,1,.8546324488038278,1,76,3,,2,,,,76,1,171.3943333333333,1,25.87144428381488,,3,,,,2,,,3,,,2,,2,,,,,,,,,,,,,,,,,,,,,,,,,,,,,,,,,
266,,Israel,3,,1,1.005035780508122,2,73,2,,2,,,,93.75,1,154.79075,1,,,,,,,3,5,,3,,,2,,1,1,2,,,,2,,,,2,,,,2,,,,2,,,,2,,,,2,,,,2,,,
267,,Israel,3,,1,1.422714297811608,2,67,3,,2,,,,88,1,158.9566666666667,1,34.82773073576203,,4,,,,2,0,,,,,1,1,,,2,,,,2,,,,2,,,,2,,,,2,,,,2,,,,1,3,2,4,2,,,
268,,Israel,3,,1,.9607733779141106,1,82,1,,2,,,,69,1,163.9753333333333,1,25.66209130773288,,3,,,,,,,,,,,,,,,,,,,,,,,,,,,,,,,,,,,,,,,,,,,,,
269,,Israel,3,,1,1.422714297811608,2,67,2,,2,,,,102.25,1,167.2455,1,36.55564357545864,,4,,,,3,5,,3,,,,,,,,,,,,,,,,,,,,,,,,,,,,,,,,,,,,,,
270,,Israel,3,,1,1.005035780508122,2,71,2,,2,,,,78.25,1,154.0251666666667,1,32.98382149242433,,4,,,,2,0,,,,,2,,1,1,1,2,1,2,2,,,,2,,,,2,,,,2,,,,2,,,,2,,,,2,,,
271,,Israel,4,,1,1.005035780508122,2,71,1,,2,,,,94,1,154.6133333333333,1,39.32185224984506,,4,,,,3,,,2,,,2,,2,,,,,,,,,,,,,,,,,,,,,,,,,,,,,,,,,
272,,Israel,4,,1,1.005035780508122,2,73,2,,2,,,,75.5,1,156.111,1,30.97989491190522,,4,,,,3,0,,,,,2,,1,2,1,2,3,3,2,,,,2,,,,2,,,,2,,,,2,,,,1,2,1,3,2,,,
273,,Israel,4,,1,1.005035780508122,2,79,2,,2,,,,80,1,154.5018333333333,1,33.51372584542119,,4,,,,2,0,,,,,1,2,,,1,2,3,4,2,,,,2,,,,2,,,,2,,,,2,,,,1,2,2,3,2,,,