id,hh_id,country,sec_area,tert_area,round,smpl_weight,sex,age,edc_level,edc,residence,preg_lact,breastfeeding,hh_head,wgt,wgt_method,hgt,hgt_method,bmi_adults,bmi_children,bmi_cat,misrep,pa,pa_cat,smok,special_diet,special_diet_other,clin_diet,clin_diet_other,note,q57,q58,q59,q60,q61_1,q61_2,q61_3,q61_4,q61_5,q61_6,q61_7,q61_8,q61_9,q61_10,q62_1,q62_2,q62_3,q62_4,q62_5,q62_6,q62_7,q62_8,q62_9,q62_10,q63_1,q63_2,q63_3,q63_4,q63_5,q63_6,q63_7,q63_8,q63_9,q63_10,q64_1,q64_2,q64_3,q64_4,q64_5,q64_6,q64_7,q64_8,q64_9,q64_10
10002431,,Israel,2,,1,.8531014189189189,1,33,2,7,2,0,,,85,1,167,1,30.47796622324214,,4,,,,3,0,,,,,3,2,,2,,,,,,,,,,,,,,,,,,,,,,,,,,,,,,,,,,,,,,,,
10013901,,Israel,2,,1,1.115346059615385,2,55,1,7,2,0,,,,,,,,,,,,,3,0,,,,,3,2,,2,,,,,,,,,,,,,,,,,,,,,,,,,,,,,,,,,,,,,,,,
10022194,,Israel,3,,1,.6643261018050541,2,34,3,2,2,0,,,111,1,163,1,41.77801196883586,,4,,,,3,0,,,,,2,2,,2,,,,,,,,,,,,,,,,,,,,,,,,,,,,,,,,,,,,,,,,
10032592,,Israel,3,,1,.8531014189189189,1,33,2,7,2,0,,,115.35,1,184,1,34.07077032136105,,4,,,,1,0,,,,,5,1,1,,1,2,2,2,2,2,2,2,2,,1,,,,,,,,,,60,,,,,,,,,,1,,,,,,,,,
10041653,,Israel,4,,1,.81394252991453,1,45,3,5,2,0,,,102,1,183.55,1,30.27550486816019,,4,,,,3,0,,,,,3,1,3,,2,2,2,1,2,2,2,2,2,,,,,3,,,,,,,,,,120,,,,,,,,,,3,,,,,,
10051776,,Israel,6,,1,1.192568051351351,1,44,3,5,2,0,,,73,1,167.5,1,26.01915794163511,,3,,,,2,3,,,,,4,2,,2,,,,,,,,,,,,,,,,,,,,,,,,,,,,,,,,,,,,,,,,
10062087,,Israel,2,,1,.8642641058593749,1,26,2,7,2,0,,,50,1,168.7,1,17.56870858396561,,1,,,,3,0,,,,,2,2,,2,,,,,,,,,,,,,,,,,,,,,,,,,,,,,,,,,,,,,,,,
1007826,,Israel,3,,1,1.337493590524194,2,26,3,3,2,0,,,60,1,162.6,1,22.69395387680814,,2,,,,2,0,,,,,2,2,,2,,,,,,,,,,,,,,,,,,,,,,,,,,,,,,,,,,,,,,,,
10085143,,Israel,2,,1,.8669813911680913,1,64,2,7,1,0,,,95,1,168,1,33.65929705215419,,4,,,,2,0,,,,,1,1,3,,1,2,2,2,2,2,2,2,2,,3,,,,,,,,,,20,,,,,,,,,,4,,,,,,,,,
10091388,,Israel,2,,1,.8531014189189189,1,32,3,2,2,0,,,75,1,174.2,1,24.71524739633108,,2,,,,3,0,,,,,1,2,,2,,,,,,,,,,,,,,,,,,,,,,,,,,,,,,,,,,,,,,,,
10101489,,Israel,2,,1,.7148622535714286,2,25,2,7,2,0,,,66,1,165.2,1,24.18376141033834,,2,,,,3,0,,,,,3,2,,2,,,,,,,,,,,,,,,,,,,,,,,,,,,,,,,,,,,,,,,,
10111201,,Israel,2,,1,.6514347804123711,2,43,2,7,2,0,,,,,,,,,,,,,3,0,,,,,3,2,,2,,,,,,,,,,,,,,,,,,,,,,,,,,,,,,,,,,,,,,,,
1011781,,Israel,4,,1,1.111996672557173,2,38,3,5,2,0,,,87,1,161.6,1,33.31474855406333,,4,,,,3,0,,,,,3,2,,2,,,,,,,,,,,,,,,,,,,,,,,,,,,,,,,,,,,,,,,,
1012779,,Israel,4,,1,.9798231796733212,2,52,2,1,2,0,,,82,1,163.1,1,30.82520193326645,,4,,,,3,0,,,,,1,2,,2,,,,,,,,,,,,,,,,,,,,,,,,,,,,,,,,,,,,,,,,
1012979,,Israel,6,,1,1.337493590524194,2,27,3,1,2,2,,,61.25,1,164,1,22.77290303390839,,2,,,,1,1,,,,,1,2,,2,,,,,,,,,,,,,,,,,,,,,,,,,,,,,,,,,,,,,,,,
10131036,,Israel,6,,1,1.111996672557173,2,35,3,5,2,2,,,67.5,1,165,1,24.79338842975207,,2,,,,3,0,,,,,1,2,,2,,,,,,,,,,,,,,,,,,,,,,,,,,,,,,,,,,,,,,,,
1013754,,Israel,4,,1,1.337493590524194,2,26,3,2,2,0,,,69.25,1,162.15,1,26.33818669096246,,3,,,,3,0,,,,,3,2,,2,,,,,,,,,,,,,,,,,,,,,,,,,,,,,,,,,,,,,,,,
10142234,,Israel,4,,1,1.192568051351351,1,42,3,1,2,0,,,74,1,168.5,1,26.06345041340506,,3,,,,2,3,,,,,1,2,,2,,,,,,,,,,,,,,,,,,,,,,,,,,,,,,,,,,,,,,,,
1014673,,Israel,4,,1,.9261367772131148,2,43,3,5,2,0,,,76.75,1,161.15,1,29.55410176757597,,3,,,,3,3,,,,,2,2,,2,,,,,,,,,,,,,,,,,,,,,,,,,,,,,,,,,,,,,,,,
10164303,,Israel,6,,1,.9798231796733212,2,50,2,7,2,0,,,75,1,160,1,29.296875,,3,,,,1,3,,,,,2,2,,2,,,,,,,,,,,,,,,,,,,,,,,,,,,,,,,,,,,,,,,,
10175296,,Israel,2,,1,.9798231796733212,2,52,3,5,1,0,,,67,1,157.25,1,27.09527071259045,,3,,,,2,0,,,,,1,1,1,,1,2,2,2,2,2,2,2,2,,1,,,,,,,,,,30,,,,,,,,,,3,,,,,,,,,
1017750,,Israel,4,,1,.8918569210992908,1,51,3,5,2,0,,,92,1,173.6,1,30.52729936927944,,4,,,,2,0,,,,,3,2,,2,,,,,,,,,,,,,,,,,,,,,,,,,,,,,,,,,,,,,,,,
10181178,,Israel,3,,1,1.40388078071066,1,31,3,2,2,0,,,80,1,178.45,1,25.12215451365432,,3,,,,3,3,,,,,1,1,4,,1,2,2,2,1,1,2,2,2,,3,,,,3,3,,,,,30,,,,60,120,,,,,1,,,,1,3,,,,
1018751,,Israel,4,,1,.9798231796733212,2,51,2,7,2,0,,,64.5,1,160.7,1,24.97629188417661,,2,,,,3,0,,,,,3,2,,2,,,,,,,,,,,,,,,,,,,,,,,,,,,,,,,,,,,,,,,,
10194074,,Israel,2,,1,.9798231796733212,2,51,2,7,2,0,,,95,1,162,1,36.19875019051974,,4,,,,3,3,,,,,,1,1,,1,2,2,2,2,2,2,2,2,,1,,,,,,,,,,60,,,,,,,,,,4,,,,,,,,,
1019777,,Israel,4,,1,.9798231796733212,2,50,3,5,2,0,,,73,1,150,1,32.44444444444444,,4,,,,3,3,,,,,1,1,1,,1,2,2,2,2,2,2,2,2,2,1,,,,,,,,,,45,,,,,,,,,,2,,,,,,,,,
1020711,,Israel,3,,1,1.379974743636363,2,50,1,7,2,0,,,100,1,157,1,40.56959714390037,,4,,,,3,0,,,,,1,2,,2,,,,,,,,,,,,,,,,,,,,,,,,,,,,,,,,,,,,,,,,
10211243,,Israel,6,,1,.9261367772131148,2,43,3,2,2,0,,,58,1,,,,,,,,,2,5,Vegetarian and on weight loss/maintenance diet,,,,1,2,,2,,,,,,,,,,,,,,,,,,,,,,,,,,,,,,,,,,,,,,,,
1021710,,Israel,3,,1,.6353458,1,60,2,7,2,0,,,86,1,175.65,1,27.87418274557297,,3,,,,3,0,,,,,3,2,,2,,,,,,,,,,,,,,,,,,,,,,,,,,,,,,,,,,,,,,,,
10224495,,Israel,2,,1,1.005141106013746,2,49,3,2,2,0,,,64.95,1,161.35,1,24.94831483160032,,2,,,,3,3,,,,,1,2,,1,2,2,1,2,2,2,2,2,1,,,,3,,,,,,1,,,,15,,,,,,3,,,,3,,,,,,3,
10244069,,Israel,4,,1,.9798231796733212,2,51,3,2,2,0,,,60,1,160.75,1,23.21930879020145,,2,,,,3,3,,,,,2,1,2,,1,2,2,2,2,2,1,2,2,,2,,,,,,5,,,,50,,,,,,120,,,,3,,,,,,4,,,
1024708,,Israel,3,,1,.7148622535714286,2,27,2,7,2,1,,,,,,,,,,,,,3,0,,,,,3,2,,1,2,2,2,2,2,2,2,1,2,2,,,,,,,,4,,,,,,,,,,5,,,,,,,,,,3,,
10251212,,Israel,5,,1,1.337493590524194,2,25,3,1,2,0,,,54,1,166,1,19.5964581216432,,2,,,,1,0,,,,,4,2,,2,,,,,,,,,,,,,,,,,,,,,,,,,,,,,,,,,,,,,,,,
1025705,,Israel,3,,1,.6353458,1,61,2,7,2,0,,,79,1,172,1,26.70362358031368,,3,,,,2,0,,,,,1,2,,2,,,,,,,,,,,,,,,,,,,,,,,,,,,,,,,,,,,,,,,,
10263835,,Israel,5,,1,.9798231796733212,2,53,2,7,2,0,,,65,1,155.45,1,26.89873794225276,,3,,,,3,0,,,,,1,2,,2,,,,,,,,,,,,,,,,,,,,,,,,,,,,,,,,,,,,,,,,
1026703,,Israel,3,,1,.4742898196581197,1,59,1,7,2,0,,,80,1,172,1,27.04164413196322,,3,,,,1,0,,,,,1,2,,2,,,,,,,,,,,,,,,,,,,,,,,,,,,,,,,,,,,,,,,,
10271197,,Israel,5,,1,.9261367772131148,2,40,2,7,2,0,,,77,1,156.1,1,31.59984257532972,,4,,,,3,0,,,,,1,1,3,,1,2,2,2,2,2,2,2,2,,3,,,,,,,,,,40,,,,,,,,,,1,,,,,,,,,
1027702,,Israel,3,,1,.6353458,1,64,2,7,2,0,,,96,1,185.75,1,27.82361710645251,,3,,,,1,0,,,,,3,2,,2,,,,,,,,,,,,,,,,,,,,,,,,,,,,,,,,,,,,,,,,
10281067,,Israel,5,,1,1.111996672557173,2,36,3,5,2,0,,,71,1,161.45,1,27.2384411900475,,3,,,,3,3,,,,,6,2,,2,,,,,,,,,,,,,,,,,,,,,,,,,,,,,,,,,,,,,,,,
1029701,,Israel,3,,1,.4742898196581197,1,57,2,7,2,0,,,91,1,168,1,32.24206349206349,,4,,,,1,0,,,,,1,2,,2,,,,,,,,,,,,,,,,,,,,,,,,,,,,,,,,,,,,,,,,
10304249,,Israel,5,,1,.8918569210992908,1,51,3,4,2,0,,,75,1,174.95,1,24.50379608725018,,2,,,,3,0,,,,,2,2,,2,,,,,,,,,,,,,,,,,,,,,,,,,,,,,,,,,,,,,,,,
10311117,,Israel,4,,1,1.269976119594595,2,30,3,5,2,0,,,77.25,1,157,1,31.34001379366303,,4,,,,1,3,,,,,1,1,3,,1,2,1,2,1,2,2,1,2,2,3,,3,,2,,,3,,,60,,20,,15,,,15,,,1,,1,,1,,,1,,
10321964,,Israel,4,,1,1.40388078071066,1,30,2,7,2,0,,,71,1,174.7,1,23.26336521288109,,2,,,,1,0,,,,,3,1,2,,1,2,1,1,2,1,2,2,2,,2,,5,3,,5,,,,,30,,60,120,,30,,,,,3,,3,4,,4,,,,
1032706,,Israel,3,,1,.6353458,1,60,2,7,2,0,,,86,1,174,1,28.4053375611045,,3,,,,1,0,,,,,1,1,1,,2,2,2,2,2,2,2,1,2,2,,,,,,,,1,,,,,,,,,,15,,,,,,,,,,3,,
10331951,,Israel,5,,1,1.192568051351351,1,41,2,7,2,0,,,57,1,159.9,1,22.29348314554007,,2,,,,1,0,,,,,6,2,,2,,,,,,,,,,,,,,,,,,,,,,,,,,,,,,,,,,,,,,,,
1033707,,Israel,3,,1,1.115346059615385,2,56,1,7,2,0,,,,,,,,,,,,,1,0,,,,,3,2,,2,,,,,,,,,,,,,,,,,,,,,,,,,,,,,,,,,,,,,,,,
10344158,,Israel,4,,1,.8918569210992908,1,52,3,4,2,0,,,87.25,1,174.3,1,28.71908912594893,,3,,,,3,0,,,,,1,1,1,,2,2,1,2,2,2,2,1,2,2,,,1,,,,,1,,,,,23,,,,,10,,,,,4,,,,,4,,
10354758,,Israel,5,,1,.8277898972081219,2,59,3,1,2,0,,,75,1,162.1,1,28.54271188491883,,3,,,,3,3,,,,,2,1,4,,2,2,2,2,1,2,2,2,2,2,,,,,4,,,,,,,,,,20,,,,,,,,,,4,,,,,
1035713,,Israel,3,,1,.8531014189189189,1,30,3,2,2,0,,,76,1,173.75,1,25.17468039956524,,3,,,,3,0,,,,,1,2,,2,,,,,,,,,,,,,,,,,,,,,,,,,,,,,,,,,,,,,,,,
10364287,,Israel,5,,1,1.005141106013746,2,49,3,2,2,0,,,55,1,163.35,1,20.61220304256729,,2,,,,2,0,,,,,3,2,,2,,,,,,,,,,,,,,,,,,,,,,,,,,,,,,,,,,,,,,,,
1036712,,Israel,3,,1,.6514347804123711,2,42,1,7,2,0,,,99,1,158.1,1,39.60695498129472,,4,,,,1,0,,,,,1,2,,2,,,,,,,,,,,,,,,,,,,,,,,,,,,,,,,,,,,,,,,,
10374774,,Israel,5,,1,.9798231796733212,2,50,3,5,2,0,,,97.09999999999999,1,165,1,35.66574839302112,,4,,,,3,5,Vegetarian and on weight loss/maintenance diet,,,,2,2,,1,1,2,2,2,2,2,2,2,2,2,1,,,,,,,,,,30,,,,,,,,,,4,,,,,,,,,
1037704,,Israel,3,,1,.6514347804123711,2,43,2,7,2,2,,,63,1,155,1,26.22268470343392,,3,,,,3,0,,,,,3,2,,2,,,,,,,,,,,,,,,,,,,,,,,,,,,,,,,,,,,,,,,,
10385027,,Israel,3,,1,1.379974743636363,2,52,1,7,2,0,,,80,1,161.9,1,30.52082645819925,,4,,,,3,0,,,,,3,1,1,,1,2,2,2,2,2,2,2,2,2,1,,,,,,,,,,60,,,,,,,,,,1,,,,,,,,,
1038676,,Israel,2,,1,.8918569210992908,1,53,3,5,2,0,,,77.5,1,164.7,1,28.57028049379768,,3,,,,1,0,,,,,5,2,,2,,,,,,,,,,,,,,,,,,,,,,,,,,,,,,,,,,,,,,,,
10393616,,Israel,3,,1,.6643261018050541,2,31,2,8,2,0,,,60,1,166,1,21.77384235738133,,2,,,,1,0,,,,,3,2,,2,,,,,,,,,,,,,,,,,,,,,,,,,,,,,,,,,,,,,,,,
1039765,,Israel,4,,1,1.269976119594595,2,33,2,7,2,0,,,62,1,158.15,1,24.78867405482435,,2,,,,3,0,,,,,2,2,,2,,,,,,,,,,,,,,,,,,,,,,,,,,,,,,,,,,,,,,,,
10401354,,Israel,4,,1,1.184514065197216,1,38,3,5,2,0,,,68,1,163.3,1,25.49978643928857,,3,,,,3,0,,,,,3,2,,2,,,,,,,,,,,,,,,,,,,,,,,,,,,,,,,,,,,,,,,,
1040752,,Israel,4,,1,.9521399922252011,2,61,2,7,2,0,,,64,1,150.75,1,28.16211919946976,,3,,,,2,3,,,,,2,1,2,,1,2,2,2,2,2,2,2,2,2,2,,,,,,,,,,45,,,,,,,,,,1,,,,,,,,,
10411089,,Israel,2,,1,1.192568051351351,1,41,2,8,1,0,,,80,1,173.25,1,26.65284050565436,,3,,,,3,0,,,,,1,2,,2,,,,,,,,,,,,,,,,,,,,,,,,,,,,,,,,,,,,,,,,
1041647,,Israel,6,,1,.8277898972081219,2,58,2,7,2,0,,,68,1,153.75,1,28.76594619604733,,3,,,,3,0,,,,,1,1,1,,1,2,2,2,2,2,2,1,2,2,1,,,,,,,1,,,30,,,,,,,30,,,3,,,,,,,2,,
1042650,,Israel,6,,1,1.005141106013746,2,47,3,5,2,0,,,73,1,162,1,27.81588172534675,,3,,,,3,0,,,,,2,2,,2,,,,,,,,,,,,,,,,,,,,,,,,,,,,,,,,,,,,,,,,
10432446,,Israel,2,,1,.8642641058593749,1,25,3,5,2,0,,,89,1,175.2,1,28.99491253309981,,3,,,,1,0,,,,,5,2,,2,,,,,,,,,,,,,,,,,,,,,,,,,,,,,,,,,,,,,,,,
1043773,,Israel,6,,1,1.005141106013746,2,47,3,5,2,0,,,79.25,1,162,1,30.19737844840725,,4,,,,3,3,,,,,2,1,1,,1,2,2,2,2,2,2,2,2,2,1,,,,,,,,,,90,,,,,,,,,,2,,,,,,,,,
10441958,,Israel,2,,1,.6643261018050541,2,31,2,1,2,0,,,,,,,,,,,,,3,3,,,,,3,1,4,,1,2,2,2,2,2,2,2,2,2,,,,,,,,,,,80,,,,,,,,,,1,,,,,,,,,
1044774,,Israel,6,,1,.8669813911680913,1,60,2,7,2,0,,,74,1,164.25,1,27.42969403380988,,3,,,,2,0,,,,,1,2,,2,,,,,,,,,,,,,,,,,,,,,,,,,,,,,,,,,,,,,,,,
10451161,,Israel,2,,1,.6514347804123711,2,44,3,5,2,0,,,62,1,162.1,1,23.5953084915329,,2,,,,3,0,,,,,3,1,1,,1,2,2,2,1,2,2,2,2,2,1,,,,2,,,,,,30,,,,10,,,,,,2,,,,3,,,,,
1045648,,Israel,6,,1,1.269976119594595,2,31,2,8,2,0,,,84,1,165,1,30.85399449035813,,4,,,,1,3,,,,,3,1,1,,1,2,2,2,2,2,2,1,2,2,1,,,,,,,1,,,30,,,,,,,20,,,1,,,,,,,1,,
10461834,,Israel,4,,1,.6514347804123711,2,43,3,2,2,0,,,66,1,163,1,24.84098008957808,,2,,,,3,0,,,,,3,2,,2,,,,,,,,,,,,,,,,,,,,,,,,,,,,,,,,,,,,,,,,
1046669,,Israel,4,,1,.8277898972081219,2,57,2,7,2,0,,,95,1,165.1,1,34.85214071019858,,4,,,,3,0,,,,,4,1,1,,1,2,2,2,2,2,2,2,2,2,1,,,,,,,,,,60,,,,,,,,,,3,,,,,,,,,
10471196,,Israel,2,,1,.6607219158536586,1,39,2,7,2,0,,,100.5,1,182.2,1,30.2739658353024,,4,,,,2,0,,,,,5,2,,2,,,,,,,,,,,,,,,,,,,,,,,,,,,,,,,,,,,,,,,,
1047663,,Israel,4,,1,1.057449503667954,1,49,3,2,2,0,,,81,1,168,1,28.69897959183674,,3,,,,3,0,,,,,3,1,1,,2,2,2,2,2,2,1,2,2,1,,,,,,,2,,,3,,,,,,,180,,,100,,,,,,,3,,,4
10484768,,Israel,2,,1,.5135126141414141,2,61,1,7,2,0,,,,,,,,,,,,,3,0,,,,,1,2,,2,,,,,,,,,,,,,,,,,,,,,,,,,,,,,,,,,,,,,,,,
1048664,,Israel,4,,1,1.269976119594595,2,30,2,8,2,2,,,79,1,162.3,1,29.99093818108376,,3,,,,3,0,,,,,4,2,,2,,,,,,,,,,,,,,,,,,,,,,,,,,,,,,,,,,,,,,,,
10491756,,Israel,4,,1,1.269976119594595,2,33,3,2,2,0,,,69,1,168.5,1,24.30240646655337,,2,,,,3,0,,,,,4,2,,1,2,2,2,1,2,2,2,2,2,2,,,,5,,,,,,,,,,30,,,,,,,,,,4,,,,,,
1050990,,Israel,4,,1,.9261367772131148,2,43,3,5,2,0,,,74,1,161.95,1,28.21433476937308,,3,,,,3,3,,,,,1,1,2,,1,2,2,2,2,2,2,1,1,2,3,,,,,,,2,5,,45,,,,,,,45,45,,4,,,,,,,4,3,
1051974,,Israel,4,,1,1.269976119594595,2,33,3,5,2,0,,,83,1,160.2,1,32.34097203713835,,4,,,,3,3,,,,,1,2,,2,,,,,,,,,,,,,,,,,,,,,,,,,,,,,,,,,,,,,,,,
10521109,,Israel,4,,1,1.111996672557173,2,35,3,3,1,0,,,69.5,1,167.1,1,24.89040165229291,,2,,,,1,0,,,,,3,1,3,,2,2,2,1,1,2,2,1,2,2,,,,2,3,,,3,,,,,,25,30,,,30,,,,,,4,2,,,2,,
10531408,,Israel,2,,1,.8642641058593749,1,27,2,7,2,0,,,51.5,1,173,1,17.20739082495239,,1,,,,1,0,,,,,2,2,,2,,,,,,,,,,,,,,,,,,,,,,,,,,,,,,,,,,,,,,,,
1054885,,Israel,2,,1,.6514347804123711,2,40,2,7,2,0,,,79.5,1,165,1,29.20110192837466,,3,,,,3,0,,,,,2,2,,2,,,,,,,,,,,,,,,,,,,,,,,,,,,,,,,,,,,,,,,,
1055209,,Israel,2,,1,.6607219158536586,1,36,1,7,2,0,,,75.5,1,182,1,22.79314092500906,,2,,,,2,0,,,,,2,2,,2,,,,,,,,,,,,,,,,,,,,,,,,,,,,,,,,,,,,,,,,
10561831,,Israel,2,,1,.6643261018050541,2,34,2,1,2,0,,,72.25,1,185,1,21.11029948867787,,2,,,,3,0,,,,,2,2,,2,,,,,,,,,,,,,,,,,,,,,,,,,,,,,,,,,,,,,,,,
1056665,,Israel,4,,1,.9521399922252011,2,62,2,7,2,0,,,64,1,151.15,1,28.01326121523498,,3,,,,1,0,,,,,4,2,,2,,,,,,,,,,,,,,,,,,,,,,,,,,,,,,,,,,,,,,,,
1057642,,Israel,2,,1,.6292896886597938,1,41,1,7,2,0,,,72,1,157.7,1,28.95136933945441,,3,,,,3,0,,,,,5,2,,2,,,,,,,,,,,,,,,,,,,,,,,,,,,,,,,,,,,,,,,,
1057667,,Israel,4,,1,.9798231796733212,2,53,3,2,2,0,,,72,1,154.95,1,29.98812657613377,,3,,,,2,3,,,,,1,2,,2,,,,,,,,,,,,,,,,,,,,,,,,,,,,,,,,,,,,,,,,
1058671,,Israel,4,,1,1.111996672557173,2,37,2,7,2,1,,,,,,,,,,,,,2,0,,,,,3,2,,1,1,2,2,2,2,2,2,2,2,2,1,,,,,,,,,,30,,,,,,,,,,3,,,,,,,,,
1058690,,Israel,2,,1,.7148622535714286,2,25,3,2,2,2,,,79,1,162.25,1,30.00942542871456,,4,,,,2,0,,,,,2,2,,2,,,,,,,,,,,,,,,,,,,,,,,,,,,,,,,,,,,,,,,,
10591513,,Israel,3,,1,.6607219158536586,1,36,2,7,2,0,,,74.5,1,165.2,1,27.29833674348797,,3,,,,3,0,,,,,5,2,,2,,,,,,,,,,,,,,,,,,,,,,,,,,,,,,,,,,,,,,,,
1059668,,Israel,4,,1,1.005141106013746,2,47,2,8,2,0,,,60,1,155.05,1,24.95788097607361,,2,,,,1,0,,,,,2,1,1,,1,2,2,2,2,2,2,2,2,2,1,,,,,,,,,,60,,,,,,,,,,4,,,,,,,,,
10601456,,Israel,2,,1,.6514347804123711,2,44,2,1,2,0,,,70,1,155,1,29.1363163371488,,3,,,,3,0,,,,,2,2,,2,,,,,,,,,,,,,,,,,,,,,,,,,,,,,,,,,,,,,,,,
106107,,Israel,4,,1,1.635152403125,1,25,3,1,2,0,,,63.25,1,172.5,1,21.256038647343,,2,,,,1,0,,,,,4,2,,2,,,,,,,,,,,,,,,,,,,,,,,,,,,,,,,,,,,,,,,,
1061626,,Israel,6,,1,1.192568051351351,1,41,3,5,2,0,,,63,1,184,1,18.60822306238185,,2,,,,1,0,,,,,1,1,3,,1,2,2,2,2,2,2,2,2,2,3,,,,,,,,,,20,,,,,,,,,,3,,,,,,,,,
1061897,,Israel,4,,1,1.40388078071066,1,32,3,5,2,0,,,68,1,178.3,1,21.38977549857837,,2,,,,3,3,,,,,4,1,2,,2,1,2,2,2,2,2,1,2,,,2,,,,,,2,,,,60,,,,,,60,,,,2,,,,,,2,,
1062629,,Israel,6,,1,1.005141106013746,2,46,2,7,2,0,,,56,1,151.75,1,24.31815529421982,,2,,,,3,0,,,,,2,2,,2,,,,,,,,,,,,,,,,,,,,,,,,,,,,,,,,,,,,,,,,
1062698,,Israel,4,,1,1.635152403125,1,28,3,5,2,0,,,74.5,1,169,1,26.08452085011029,,3,,,,1,0,,,,,1,1,1,,2,2,2,2,2,2,2,1,2,2,,,,,,,,1,,,,,,,,,,25,,,,,,,,,,4,,
10631179,,Israel,4,,1,1.40388078071066,1,31,2,7,2,0,,,73,1,165.9,1,26.5234545455206,,3,,,,2,0,,,,,5,2,,2,,,,,,,,,,,,,,,,,,,,,,,,,,,,,,,,,,,,,,,,
1063761,,Israel,4,,1,.8918569210992908,1,51,3,2,2,0,,,78,1,176.5,1,25.03831986453627,,3,,,,2,0,,,,,2,1,1,,1,2,2,2,2,2,2,1,2,1,3,,,,,,,1,,3,45,,,,,,,20,,240,3,,,,,,,3,,4
10644263,,Israel,5,,1,.8277898972081219,2,55,3,5,2,0,,,70,1,164.35,1,25.91544216973708,,3,,,,3,0,,,,,1,2,,2,,,,,,,,,,,,,,,,,,,,,,,,,,,,,,,,,,,,,,,,
1064763,,Israel,4,,1,.9798231796733212,2,52,3,5,2,0,,,48,1,152.05,1,20.76196183670263,,2,,,,3,0,,,,,3,2,,2,,,,,,,,,,,,,,,,,,,,,,,,,,,,,,,,,,,,,,,,
10654295,,Israel,5,,1,.9521399922252011,2,64,3,5,2,0,,,,,,,,,,,,,1,0,,,,,77,2,,2,,,,,,,,,,,,,,,,,,,,,,,,,,,,,,,,,,,,,,,,
1065678,,Israel,2,,1,1.111996672557173,2,38,2,1,2,0,,,105,1,160,1,41.015625,,4,,,,3,0,,,,,3,2,,1,1,2,2,2,2,2,2,2,2,2,2,,,,,,,,,,30,,,,,,,,,,1,,,,,,,,,
106605,,Israel,4,,1,.9798231796733212,2,54,2,7,2,0,,,74.75,1,168.05,1,26.46879457480006,,3,,,,3,0,,,,,1,2,,1,2,2,1,2,1,2,1,2,2,2,,,3,,1,,5,,,,,,7,,5,,10,,,,,,3,,4,,1,,,
10664340,,Israel,4,,1,.9521399922252011,2,60,2,1,2,0,,,53,1,155,1,22.06035379812695,,2,,,,3,3,,,,,3,1,2,,2,2,2,1,2,2,2,2,2,2,,,,2,,,,,,,,,,30,,,,,,,,,,3,,,,,,
1066756,,Israel,4,,1,.9798231796733212,2,51,3,5,2,0,,,57,1,158.2,1,22.77518415933999,,2,,,,2,0,,,,,4,1,3,,1,2,2,2,2,2,2,1,2,2,3,,,,,,,3,,,60,,,,,,,20,,,2,,,,,,,2,,
1067755,,Israel,4,,1,.9261367772131148,2,40,2,1,2,0,,,61.25,1,162.95,1,23.06733184691841,,2,,,,1,5,Vegetarian and on weight loss/maintenance diet,,,,2,2,,2,,,,,,,,,,,,,,,,,,,,,,,,,,,,,,,,,,,,,,,,
1068762,,Israel,4,,1,.9798231796733212,2,52,3,3,2,0,,,92,1,164.25,1,34.10178177176363,,4,,,,3,0,,,,,5,1,1,,1,2,1,1,2,2,2,2,2,2,2,,,1,,,,,,,20,,10,45,,,,,,,3,,2,3,,,,,,
1069770,,Israel,1,,1,1.005141106013746,2,49,3,2,2,0,,,79.5,1,171.1,1,27.15608188634685,,3,,,,3,0,,,,,4,1,1,,1,2,1,2,2,2,1,1,2,2,2,,4,,,,3,2,,,30,,30,,,,120,20,,,2,,2,,,,4,2,,
107115,,Israel,6,,1,.9261367772131148,2,43,3,5,2,0,,,57.25,1,158.15,1,22.88954176836603,,2,,,,1,0,,,,,1,2,,2,,,,,,,,,,,,,,,,,,,,,,,,,,,,,,,,,,,,,,,,
1074103,,Israel,1,,1,1.337493590524194,2,27,3,5,2,0,,,48.25,1,152.95,1,20.62520885695627,,2,,,,3,0,,,,,1,1,3,,2,2,2,2,2,2,2,1,2,2,,,,,,,,3,,,,,,,,,,60,,,,,,,,,,1,,
1079722,,Israel,1,,1,.9798231796733212,2,53,3,3,2,0,,,95.25,1,161.6,1,36.47390574453485,,4,,,,1,0,,,,,1,2,,1,1,2,2,2,2,2,2,2,2,2,1,,,,,,,,,,10,,,,,,,,,,4,,,,,,,,,
1081526,,Israel,6,,1,.8277898972081219,2,55,3,1,2,0,,,62,1,154.05,1,26.12572097245412,,3,,,,1,0,,,,,2,2,,2,,,,,,,,,,,,,,,,,,,,,,,,,,,,,,,,,,,,,,,,
1081677,,Israel,2,,1,1.635152403125,1,29,3,1,2,0,,,64,1,,,,,,,,,1,0,,,,,1,2,,2,,,,,,,,,,,,,,,,,,,,,,,,,,,,,,,,,,,,,,,,
10824548,,Israel,3,,1,.81394252991453,1,49,2,7,2,0,,,80,1,166,1,29.03178980984178,,3,,,,1,0,,,,,1,2,,2,,,,,,,,,,,,,,,,,,,,,,,,,,,,,,,,,,,,,,,,
1082780,,Israel,4,,1,1.111996672557173,2,37,3,5,2,0,,,58,1,172.25,1,19.54832417356721,,2,,,,1,0,,,,,1,2,,2,,,,,,,,,,,,,,,,,,,,,,,,,,,,,,,,,,,,,,,,
1083785,,Israel,4,,1,1.635152403125,1,28,3,5,2,0,,,75,1,166.15,1,27.16818163994209,,3,,,,3,0,,,,,5,2,,2,,,,,,,,,,,,,,,,,,,,,,,,,,,,,,,,,,,,,,,,
1084786,,Israel,4,,1,1.40388078071066,1,34,3,5,2,0,,,79,1,177.05,1,25.20201287519796,,3,,,,3,0,,,,,2,1,2,,2,1,2,2,2,2,2,1,2,2,,2,,,,,,1,,,,25,,,,,,60,,,,4,,,,,,4,,
1085787,,Israel,4,,1,1.111996672557173,2,39,2,7,2,0,,,59,1,166.6,1,21.25700220064016,,2,,,,3,0,,,,,2,2,,2,,,,,,,,,,,,,,,,,,,,,,,,,,,,,,,,,,,,,,,,
1086788,,Israel,4,,1,.9261367772131148,2,40,3,2,2,0,,,65,1,168.4,1,22.92076889658713,,2,,,,3,0,,,,,2,2,,2,,,,,,,,,,,,,,,,,,,,,,,,,,,,,,,,,,,,,,,,
1087778,,Israel,4,,1,.9261367772131148,2,44,3,3,2,0,,,67.5,1,170.05,1,23.34266838341906,,2,,,,3,0,,,,,1,1,3,,1,2,2,2,2,2,2,2,1,2,3,,,,,,,,3,,40,,,,,,,,45,,2,,,,,,,,4,
1089826,,Israel,4,,1,.9798231796733212,2,53,3,3,2,0,,,,,,,,,,,,,3,0,,,,,2,2,,2,,,,,,,,,,,,,,,,,,,,,,,,,,,,,,,,,,,,,,,,
109,,Israel,4,,1,.8531014189189189,1,31,3,5,2,0,,,90,1,180.9,1,27.50206953073219,,3,,,,3,0,,,,,5,1,1,,2,1,2,2,2,1,2,2,1,2,,1,,,,1,,,1,,,30,,,,90,,,40,,,4,,,,4,,,4,
1090818,,Israel,3,,1,.6607219158536586,1,37,2,7,2,0,,,76.5,1,176.2,1,24.64050628671114,,2,,,,2,3,,,,,5,2,,2,,,,,,,,,,,,,,,,,,,,,,,,,,,,,,,,,,,,,,,,
1090819,,Israel,4,,1,1.192568051351351,1,40,2,1,2,0,,,61,1,159.25,1,24.05309424820526,,2,,,,1,0,,,,,1,2,,2,,,,,,,,,,,,,,,,,,,,,,,,,,,,,,,,,,,,,,,,
10942056,,Israel,2,,1,.8531014189189189,1,33,2,7,2,0,,,61,1,181.2,1,18.57861984610812,,2,,,,1,0,,,,,3,2,,2,,,,,,,,,,,,,,,,,,,,,,,,,,,,,,,,,,,,,,,,
10952086,,Israel,4,,1,1.40388078071066,1,33,3,5,1,0,,,76,1,170.85,1,26.03656132736445,,3,,,,1,0,,,,,5,1,3,,2,1,1,1,1,1,2,1,2,,,3,3,3,3,3,,3,,,,60,60,60,20,90,,15,,,,4,1,4,4,4,,4,,
10961361,,Israel,4,,1,.9261367772131148,2,41,3,2,2,0,,,53,1,156.5,1,21.63949820861701,,2,,,,3,3,,,,,2,1,3,,1,2,2,2,2,2,2,2,2,2,3,,,,,,,,,,30,,,,,,,,,,3,,,,,,,,,
10963,,Israel,2,,1,1.269976119594595,2,31,3,5,2,1,,,,,,,,,,,,,3,0,,,,,1,1,1,,2,2,2,2,1,2,2,1,2,2,,,,,1,,,1,,,,,,,30,,,30,,,,,,,2,,,2,,
10974661,,Israel,4,,1,.8277898972081219,2,57,3,3,2,0,,,61.25,1,152.25,1,26.42356982428326,,3,,,,3,0,,,,,2,2,,2,,,,,,,,,,,,,,,,,,,,,,,,,,,,,,,,,,,,,,,,
109981,,Israel,1,,1,1.111996672557173,2,38,3,2,2,0,,,60.25,1,162.2,1,22.90104770867891,,2,,,,2,3,,,,,1,1,1,,1,2,2,2,1,2,2,1,2,2,3,,,,3,,,3,,,45,,,,30,,,30,,,3,,,,4,,,4,,
1101662,,Israel,2,,1,.9579248445945947,1,53,2,7,2,0,,,,,,,,,,,,,3,0,,,,,3,2,,2,,,,,,,,,,,,,,,,,,,,,,,,,,,,,,,,,,,,,,,,
1102757,,Israel,2,,1,.7148622535714286,2,25,2,1,2,0,,,58,1,162,1,22.10028959000152,,2,,,,3,0,,,,,3,2,,2,,,,,,,,,,,,,,,,,,,,,,,,,,,,,,,,,,,,,,,,
1103760,,Israel,2,,1,.6607219158536586,1,39,3,5,2,0,,,71,1,170,1,24.5674740484429,,2,,,,3,0,,,,,3,2,,2,,,,,,,,,,,,,,,,,,,,,,,,,,,,,,,,,,,,,,,,
110382,,Israel,5,,1,.9798231796733212,2,51,3,1,2,0,,,74,1,162.65,1,27.97200418181464,,3,,,,2,3,,,,,3,1,1,,1,2,2,2,2,2,2,1,2,2,1,,,,,,,1,,,53,,,,,,,17,,,3,,,,,,,3,,
11041803,,Israel,4,,1,.9261367772131148,2,41,3,2,2,0,,,67,1,156.5,1,27.35559207504415,,3,,,,3,0,,,,,2,2,,2,,,,,,,,,,,,,,,,,,,,,,,,,,,,,,,,,,,,,,,,
1104655,,Israel,2,,1,.81394252991453,1,48,3,5,2,0,,,,,,,,,,,,,2,0,,,,,3,1,1,,1,2,2,2,2,2,2,2,2,2,1,,,,,,,,,,60,,,,,,,,,,3,,,,,,,,,
11054372,,Israel,4,,1,.9798231796733212,2,50,2,6,2,0,,,68,1,153.75,1,28.76594619604733,,3,,,,3,0,,,,,4,1,3,,1,2,2,2,2,2,2,2,2,2,3,,,,,,,,,,30,,,,,,,,,,2,,,,,,,,,
11061802,,Israel,4,,1,.9261367772131148,2,42,2,1,2,0,,,76,1,155.25,1,31.53191699015406,,4,,,,3,3,,,,,1,1,1,,2,2,1,2,1,2,2,1,2,,,,3,,1,,,1,,,,,10,,45,,,45,,,,,1,,3,,,3,,
11062,,Israel,2,,1,1.40388078071066,1,31,2,8,1,0,,,64,1,181,1,19.53542321662953,,2,,,,1,0,,,,,5,2,,2,,,,,,,,,,,,,,,,,,,,,,,,,,,,,,,,,,,,,,,,
11071821,,Israel,4,,1,1.40388078071066,1,32,3,3,2,0,,,72,1,179.05,1,22.45866027385061,,2,,,,1,0,,,,,1,2,,2,,,,,,,,,,,,,,,,,,,,,,,,,,,,,,,,,,,,,,,,
11082762,,Israel,4,,1,1.184514065197216,1,37,3,5,2,0,,,64,1,172.25,1,21.57056460531554,,2,,,,1,0,,,,,2,2,,2,,,,,,,,,,,,,,,,,,,,,,,,,,,,,,,,,,,,,,,,
11091786,,Israel,2,,1,.9261367772131148,2,43,3,5,1,0,,,58,1,155.5,1,23.98651792268483,,2,,,,3,0,,,,,6,2,,2,,,,,,,,,,,,,,,,,,,,,,,,,,,,,,,,,,,,,,,,
1110,,Israel,3,,1,.832286362371134,2,35,2,7,2,0,,,80.84999999999999,1,160,1,31.58203125,,4,,,,3,0,,,,,5,2,,1,2,2,1,2,2,2,2,2,2,2,,,1,,,,,,,,,,15,,,,,,,,,,1,,,,,,,
11101209,,Israel,4,,1,1.184514065197216,1,37,2,7,2,0,,,113.35,1,185.8,1,32.83447715693691,,4,,,,1,0,,,,,5,2,,2,,,,,,,,,,,,,,,,,,,,,,,,,,,,,,,,,,,,,,,,
1111285,,Israel,3,,1,.6643261018050541,2,31,2,1,2,1,,,,,,,,,,,,,1,3,,,,,,,,,,,,,,,,,,,,,,,,,,,,,,,,,,,,,,,,,,,,,,,,
11122604,,Israel,1,,1,.6607219158536586,1,39,3,2,2,0,,,73,1,165.15,1,26.76490486680381,,3,,,,1,0,,,,,2,1,1,,2,1,2,2,2,2,2,2,2,,,1,,,,,,,,,,60,,,,,,,,,,3,,,,,,,,
1112424,,Israel,6,,1,1.40388078071066,1,32,3,2,2,0,,,86,1,175.85,1,27.81081434834291,,3,,,,1,0,,,,,1,2,,2,,,,,,,,,,,,,,,,,,,,,,,,,,,,,,,,,,,,,,,,
1112656,,Israel,2,,1,.8642641058593749,1,29,2,1,2,0,,,69,1,169.5,1,24.01649829012974,,2,,,,3,0,,,,,1,2,,2,,,,,,,,,,,,,,,,,,,,,,,,,,,,,,,,,,,,,,,,
11132037,,Israel,5,,1,1.337493590524194,2,27,3,2,2,0,,,48,1,158.35,1,19.14278413250635,,2,,,,3,0,,,,,1,2,,1,2,2,2,2,2,2,2,1,2,2,,,,,,,,4,,,,,,,,,,45,,,,,,,,,,2,,
1113758,,Israel,2,,1,.8642641058593749,1,28,3,5,2,0,,,,,,,,,,,,,1,3,,,,,3,2,,2,,,,,,,,,,,,,,,,,,,,,,,,,,,,,,,,,,,,,,,,
11144357,,Israel,4,,1,1.005141106013746,2,46,3,3,2,0,,,69.25,1,172.5,1,23.27242176013443,,2,,,,3,0,,,,,1,1,3,,1,2,2,2,2,2,2,2,2,2,3,,,,,,,,,,60,,,,,,,,,,1,,,,,,,,,
11154442,,Israel,4,,1,.9521399922252011,2,64,2,1,2,0,,,76.75,1,156.25,1,31.4368,,4,,,,3,0,,,,,,,,,,,,,,,,,,,,,,,,,,,,,,,,,,,,,,,,,,,,,,,,
11164629,,Israel,4,,1,.9798231796733212,2,53,3,5,2,0,,,64.25,1,161.25,1,24.71005348236284,,2,,,,3,3,,,,,1,2,,2,,,,,,,,,,,,,,,,,,,,,,,,,,,,,,,,,,,,,,,,
11167,,Israel,2,,1,.8642641058593749,1,27,3,5,2,0,,,94,1,191,1,25.7668375318659,,3,,,,3,0,,,,,3,1,4,,2,1,2,2,2,2,2,2,2,2,,4,,,,,,,,,,30,,,,,,,,,,3,,,,,,,,
1118759,,Israel,2,,1,.6292896886597938,1,40,3,2,2,0,,,87,1,182.5,1,26.12122349408895,,3,,,,1,0,,,,,3,2,,2,,,,,,,,,,,,,,,,,,,,,,,,,,,,,,,,,,,,,,,,