id,hh_id,country,sec_area,tert_area,round,smpl_weight,sex,age,edc_level,edc,residence,preg_lact,breastfeeding,hh_head,wgt,wgt_method,hgt,hgt_method,bmi_adults,bmi_children,bmi_cat,misrep,pa,pa_cat,smok,special_diet,special_diet_other,clin_diet,clin_diet_other,note,edu_level,bmi_chld,pa_type
60311102,603111,India,2,Ahmadabad,1,,2,38,,,1,0,,,44.4,1,150.8,1,19.52451646039865,,2,,,,3,,,,,,1,,2
60311301,603113,India,2,Ahmadabad,1,,1,55,,,1,,,,66.2,1,166.2,1,23.96602182862919,,2,,,,3,,,,,,4,,1
60610708,606107,India,2,Ahmadabad,1,,2,20,,,1,0,,,56.1,1,160,1,21.9140625,,2,,,,3,,,,,,5,,1
60011603,600116,India,2,Ahmadabad,1,,1,21,,,1,,,,41.5,1,160.2,1,16.17048601856918,,1,,,,3,,,,,,5,,1
60012005,600120,India,2,Ahmadabad,1,,2,4.9166665,,,1,,,,13.7,1,104.2,1,,,,,,,,,,,,,,12.617844,1
60011201,600112,India,2,Ahmadabad,1,,1,35,,,1,,,,69.5,1,158.6,1,27.62984436645363,,3,,,,1,,,,,,1,,2
60911301,609113,India,2,Ahmadabad,1,,1,33,,,1,,,,51.4,1,167.6,1,18.29848314830743,,1,,,,3,,,,,,5,,1
60310104,603101,India,2,Ahmadabad,1,,2,33,,,1,0,,,44.6,1,152.8,1,19.10240947342452,,2,,,,3,,,,,,5,,1
60920505,609205,India,2,Ahmadabad,1,,1,12,,,1,,,,26.7,1,145.8,1,,,,,,,,,,,,,5,12.56019,1
60020501,600205,India,2,Ahmadabad,1,,1,62,,,1,,,,43.5,1,168.3,1,15.35751771675018,,1,,,,3,,,,,,3,,2
60631102,606311,India,2,Ahmadabad,1,,2,39,,,1,0,,,47.4,1,150.9,1,20.81612380060261,,2,,,,3,,,,,,3,,1
60911902,609119,India,2,Ahmadabad,1,,2,45,,,1,0,,,37.6,1,153,1,16.06219829979922,,1,,,,3,,,,,,1,,2
60011005,600110,India,2,Ahmadabad,1,,1,3,,,1,,,,12.4,1,88.8,1,,,,,,,,,,,,,,15.725184,1
60020901,600209,India,2,Ahmadabad,1,,1,45,,,1,,,,69,1,166.4,1,24.91967917899408,,2,,,,3,,,,,,5,,1
60941105,609411,India,2,Ahmadabad,1,,1,2.25,,,1,,,,14,1,84.40000000000001,1,,,,,,,,,,,,,,19.653646,1
60910502,609105,India,2,Ahmadabad,1,,2,44,,,1,0,,,44.9,1,155.2,1,18.64072962057605,,2,,,,3,,,,,,1,,2
60331101,603311,India,2,Ahmadabad,1,,1,42,,,1,,,,57.4,1,161.1,1,22.11672467490534,,2,,,,1,,,,,,4,,1
60641302,606413,India,2,Ahmadabad,1,,2,38,,,1,0,,,45.9,1,157.2,1,18.57409241885671,,2,,,,3,,,,,,3,,1
60610305,606103,India,2,Ahmadabad,1,,1,6,,,1,,,,16.9,1,113.3,1,,,,,,,,,,,,,3,13.165182,1
60010801,600108,India,2,Ahmadabad,1,,1,43,,,1,,,,46.1,1,159.1,1,18.2121226367203,,1,,,,3,,,,,,1,,2
60331103,603311,India,2,Ahmadabad,1,,1,18,,,1,,,,46.9,1,164.8,1,,,,,,,3,,,,,,5,17.268652,1
60311104,603111,India,2,Ahmadabad,1,,2,11,,,1,,,,33.9,1,137.4,1,,,,,,,,,,,,,4,17.956688,1
60310506,603105,India,2,Ahmadabad,1,,1,4.25,,,1,,,,14,1,102.4,1,,,,,,,,,,,,,,13.35144,1
60310902,603109,India,2,Ahmadabad,1,,2,40,,,1,0,,,41.9,1,158.8,1,16.61548515630452,,1,,,,3,,,,,,1,,1
60330905,603309,India,2,Ahmadabad,1,,2,6,,,1,,,,13.9,1,98.09999999999999,1,,,,,,,,,,,,,3,14.443645,1
60931502,609315,India,2,Ahmadabad,1,,2,29,,,1,0,,,43.3,1,147.4,1,19.92934059197046,,2,,,,3,,,,,,1,,2
60030702,600307,India,2,Ahmadabad,1,,2,25,,,1,0,,,38.9,1,156.3,1,15.92324749106517,,1,,,,3,,,,,,1,,2
60631104,606311,India,2,Ahmadabad,1,,2,16,,,1,0,,,32.3,1,147.5,1,,,,,,,,,,,,,4,14.846309,1
60311503,603115,India,2,Ahmadabad,1,,1,16,,,1,,,,49.2,1,168.5,1,,,,,,,,,,,,,5,17.328672,1
60021303,600213,India,2,Ahmadabad,1,,2,18,,,1,0,,,44.6,1,155.2,1,,,,,,,3,,,,,,6,18.516182,1
60020107,600201,India,2,Ahmadabad,1,,2,12,,,1,,,,33.3,1,144.3,1,,,,,,,,,,,,,3,15.992324,1
60031101,600311,India,2,Ahmadabad,1,,1,68,,,1,,,,43.2,1,163.8,1,16.1011150022139,,1,,,,3,,,,,,1,,2
60930301,609303,India,2,Ahmadabad,1,,1,34,,,1,,,,47,1,161,1,18.13201651170865,,1,,,,3,,,,,,1,,2
60020502,600205,India,2,Ahmadabad,1,,2,59,,,1,,,,49.1,1,159.8,1,19.22772677361094,,2,,,,3,,,,,,3,,1
60310303,603103,India,2,Ahmadabad,1,,1,22,,,1,,,,45.4,1,167.2,1,16.23989835397542,,1,,,,3,,,,,,5,,2
60010202,600102,India,2,Ahmadabad,1,,2,34,,,1,0,,,49.4,1,150.1,1,21.92631072955583,,2,,,,3,,,,,,5,,2
60640302,606403,India,2,Ahmadabad,1,,2,45,,,1,0,,,59.4,1,145.8,1,27.94289488390997,,3,,,,3,,,,,,3,,1
60011606,600116,India,2,Ahmadabad,1,,2,15,,,1,,,,44.4,1,157.6,1,,,,,,,,,,,,,5,17.876009,1
60311101,603111,India,2,Ahmadabad,1,,1,40,,,1,,,,64.8,1,166.1,1,23.48744309822572,,2,,,,3,,,,,,3,,2
60930505,609305,India,2,Ahmadabad,1,,2,10,,,1,,,,21.1,1,122.4,1,,,,,,,,,,,,,3,14.083793,1
60620701,606207,India,2,Ahmadabad,1,,1,40,,,1,,,,90.09999999999999,1,175.8,1,29.15325487516194,,3,,,,3,,,,,,5,,1
60631701,606317,India,2,Ahmadabad,1,,1,40,,,1,,,,59.5,1,155.2,1,24.70208045488363,,2,,,,3,,,,,,4,,1
60320502,603205,India,2,Ahmadabad,1,,2,74,,,1,,,,42.5,1,149.8,1,18.93936017939362,,2,,,,3,,,,,,1,,1
60310302,603103,India,2,Ahmadabad,1,,2,43,,,1,0,,,37.1,1,147.7,1,17.00642072601373,,1,,,,3,,,,,,4,,1
60941101,609411,India,2,Ahmadabad,1,,1,28,,,1,,,,51,1,169.8,1,17.68865470497405,,1,,,,3,,,,,,5,,2
60630501,606305,India,2,Ahmadabad,1,,1,45,,,1,,,,84.40000000000001,1,183.6,1,25.03785343718703,,3,,,,3,,,,,,4,,2
60331304,603313,India,2,Ahmadabad,1,,1,2.6666667,,,1,,,,11.1,1,82.8,1,,,,,,,,,,,,,,16.190577,1
60310305,603103,India,2,Ahmadabad,1,,2,12,,,1,,,,23.6,1,137,1,,,,,,,,,,,,,4,12.573925,1
60921105,609211,India,2,Ahmadabad,1,,2,57,,,1,,,,50.3,1,154.4,1,21.09955971972402,,2,,,,3,,,,,,1,,1
60010804,600108,India,2,Ahmadabad,1,,2,13,,,1,,,,24.8,1,138.2,1,,,,,,,,,,,,,4,12.98481,1
60310703,603107,India,2,Ahmadabad,1,,1,18,,,1,,,,68,1,165,1,,,,,,,3,,,,,,5,24.977043,1
60011001,600110,India,2,Ahmadabad,1,,1,40,,,1,,,,51.8,1,157.6,1,20.85534283284805,,2,,,,3,,,,,,1,,2
60641303,606413,India,2,Ahmadabad,1,,1,15,,,1,,,,38.7,1,156.2,1,,,,,,,,,,,,,5,15.86167,1
60331302,603313,India,2,Ahmadabad,1,,2,23,,,1,0,,,55.6,1,145.6,1,26.22720685907499,,3,,,,3,,,,,,4,,2
60611103,606111,India,2,Ahmadabad,1,,2,1.75,,,1,,0,,11.2,1,85.7,1,,,,,,,,,,,,,,15.249527,1
60621501,606215,India,2,Ahmadabad,1,,1,32,,,1,,,,61.9,1,178.1,1,19.5147418269014,,2,,,,3,,,,,,6,,2
60930903,609309,India,2,Ahmadabad,1,,1,1.4166666,,,1,,1,,8,1,73.40000000000001,1,,,,,,,,,,,,,,14.849023,1
60331505,603315,India,2,Ahmadabad,1,,2,70,,,1,,,,55.5,1,140.8,1,27.9954642303719,,3,,,,3,,,,,,1,,1
60321504,603215,India,2,Ahmadabad,1,,1,6,,,1,,,,15.7,1,103.6,1,,,,,,,,,,,,,3,14.627838,1
60331702,603317,India,2,Ahmadabad,1,,2,55,,,1,,,,45.4,1,157.1,1,18.39515632033666,,1,,,,3,,,,,,1,,1
60021305,600213,India,2,Ahmadabad,1,,2,10,,,1,,,,23.8,1,123.8,1,,,,,,,,,,,,,4,15.52872,1
60310702,603107,India,2,Ahmadabad,1,,2,48,,,1,0,,,66.2,1,150.8,1,29.1108781459097,,3,,,,3,,,,,,6,,1
60010404,600104,India,2,Ahmadabad,1,,2,16,,,1,0,,,38.2,1,146.4,1,,,,,,,,,,,,,5,17.823017,1
60020503,600205,India,2,Ahmadabad,1,,1,32,,,1,,,,55.1,1,171.8,1,18.66832185677636,,2,,,,3,,,,,,4,,2
60330303,603303,India,2,Ahmadabad,1,,1,3.25,,,1,,,,10.7,1,84.40000000000001,1,,,,,,,,,,,,,,15.021001,1
60021307,600213,India,2,Ahmadabad,1,,1,4.1666665,,,1,,,,12.8,1,94.09999999999999,1,,,,,,,,,,,,,,14.45542,1
60620510,606205,India,2,Ahmadabad,1,,2,60,,,1,,,,37.6,1,149.4,1,16.84560643287115,,1,,,,3,,,,,,1,,1
60310502,603105,India,2,Ahmadabad,1,,2,55,,,1,,,,63.1,1,151.1,1,27.63760659202907,,3,,,,3,,,,,,3,,1
60911503,609115,India,2,Ahmadabad,1,,2,6,,,1,,,,13.3,1,105.8,1,,,,,,,,,,,,,3,11.881747,1
60610101,606101,India,2,Ahmadabad,1,,1,34,,,1,,,,86.7,1,175.6,1,28.11707079145501,,3,,,,3,,,,,,5,,2
60320904,603209,India,2,Ahmadabad,1,,2,3.0833333,,,1,,,,10.6,1,83.90000000000001,1,,,,,,,,,,,,,,15.058508,1
60021304,600213,India,2,Ahmadabad,1,,2,12,,,1,,,,25.6,1,138.7,1,,,,,,,,,,,,,4,13.307211,1
60910303,609103,India,2,Ahmadabad,1,,2,8,,,1,,,,18.9,1,116,1,,,,,,,,,,,,,3,14.045779,1
60021102,600211,India,2,Ahmadabad,1,,2,29,,,1,0,,,41.8,1,170.4,1,14.39584297648174,,1,,,,3,,,,,,1,,1
60621701,606217,India,2,Ahmadabad,1,,1,53,,,1,,,,50.8,1,158.2,1,20.29788342621879,,2,,,,3,,,,,,5,,2
60320302,603203,India,2,Ahmadabad,1,,2,31,,,1,0,,,48.6,1,146.4,1,22.67535608707336,,2,,,,3,,,,,,6,,1
60020701,600207,India,2,Ahmadabad,1,,1,26,,,1,,,,60.6,1,170.2,1,20.91960657331321,,2,,,,3,,,,,,5,,2
60311305,603113,India,2,Ahmadabad,1,,1,6.4166665,,,1,,,,16,1,114.2,1,,,,,,,,,,,,,3,12.268395,1
60011202,600112,India,2,Ahmadabad,1,,2,30,,,1,0,,,39,1,143.8,1,18.86022349848441,,2,,,,3,,,,,,1,,2
60020309,600203,India,2,Ahmadabad,1,,2,73,,,1,,,,42.9,1,152.1,1,18.54380552605405,,2,,,,3,,,,,,1,,1
60640501,606405,India,2,Ahmadabad,1,,1,42,,,1,,,,59.2,1,169.6,1,20.5811676753293,,2,,,,1,,,,,,4,,1
60620101,606201,India,2,Ahmadabad,1,,1,47,,,1,,,,59.9,1,157.1,1,24.27026131251466,,2,,,,3,,,,,,3,,2
60611301,606113,India,2,Ahmadabad,1,,1,25,,,1,,,,39.6,1,154.9,1,16.50411915307195,,1,,,,3,,,,,,5,,1
60631105,606311,India,2,Ahmadabad,1,,2,14,,,1,,,,35.9,1,147.3,1,,,,,,,,,,,,,4,16.545845,1
60631903,606319,India,2,Ahmadabad,1,,1,8,,,1,,,,19.5,1,121.6,1,,,,,,,,,,,,,3,13.187652,1
60611101,606111,India,2,Ahmadabad,1,,1,35,,,1,,,,65.40000000000001,1,167.4,1,23.33817225712242,,2,,,,3,,,,,,5,,2
60641904,606419,India,2,Ahmadabad,1,,1,23,,,1,,,,72.59999999999999,1,161.6,1,27.8005832761494,,3,,,,3,,,,,,6,,1
60621901,606219,India,2,Ahmadabad,1,,1,60,,,1,,,,29,1,165.2,1,10.62619819545169,,1,,,,3,,,,,,4,,2
60640904,606409,India,2,Ahmadabad,1,,1,19,,,1,,,,47.6,1,164.2,1,,,,,,,3,,,,,,4,17.654713,2
60621502,606215,India,2,Ahmadabad,1,,2,30,,,1,0,,,57.6,1,160.4,1,22.38792047313138,,2,,,,3,,,,,,5,,1
60931901,609319,India,2,Ahmadabad,1,,1,45,,,1,,,,47.8,1,165.9,1,17.36741270240938,,1,,,,3,,,,,,1,,2
60620904,606209,India,2,Ahmadabad,1,,2,19,,,1,0,,,36.1,1,148.8,1,,,,,,,3,,,,,,5,16.30427,1
60930705,609307,India,2,Ahmadabad,1,,2,16,,,1,0,,,40.5,1,144.2,1,,,,,,,,,,,,,4,19.47711,1
60310306,603103,India,2,Ahmadabad,1,,2,7,,,1,,,,15.6,1,115.6,1,,,,,,,,,,,,,3,11.673711,1
60621704,606217,India,2,Ahmadabad,1,,2,26,,,1,1,,,47.2,1,149.3,1,21.17494949639958,,2,,,,3,,,,,,5,,1
60930504,609305,India,2,Ahmadabad,1,,1,12,,,1,,,,22,1,129,1,,,,,,,,,,,,,4,13.22036,1
60921905,609219,India,2,Ahmadabad,1,,1,15,,,1,,,,42.4,1,157.9,1,,,,,,,,,,,,,5,17.005978,1
60321703,603217,India,2,Ahmadabad,1,,1,30,,,1,,,,51,1,162.2,1,19.38511922228422,,2,,,,3,,,,,,5,,2
60930702,609307,India,2,Ahmadabad,1,,2,38,,,1,0,,,50.7,1,156.9,1,20.59501308209855,,2,,,,3,,,,,,4,,1
60931506,609315,India,2,Ahmadabad,1,,1,3.5833333,,,1,,,,11.1,1,88.40000000000001,1,,,,,,,,,,,,,,14.204254,1
60911901,609119,India,2,Ahmadabad,1,,1,60,,,1,,,,59.1,1,167.8,1,20.98957127291272,,2,,,,3,,,,,,3,,2
60941702,609417,India,2,Ahmadabad,1,,2,60,,,1,,,,33.3,1,143.8,1,16.10372929485977,,1,,,,3,,,,,,1,,2
60931102,609311,India,2,Ahmadabad,1,,2,44,,,1,0,,,58.9,1,155.3,1,24.42150269776752,,2,,,,3,,,,,,4,,1
60011002,600110,India,2,Ahmadabad,1,,2,35,,,1,0,,,52,1,150.7,1,22.89690799273816,,2,,,,3,,,,,,1,,2
60610702,606107,India,2,Ahmadabad,1,,2,50,,,1,,,,60.1,1,156.2,1,24.632722419958,,2,,,,3,,,,,,3,,1
60640102,606401,India,2,Ahmadabad,1,,2,28,,,1,0,,,37.6,1,149.4,1,16.84560643287115,,1,,,,3,,,,,,5,,1
60012002,600120,India,2,Ahmadabad,1,,2,34,,,1,0,,,49,1,148.2,1,22.31000526334002,,2,,,,3,,,,,,5,,2
60331104,603311,India,2,Ahmadabad,1,,2,15,,,1,0,,,37.3,1,157.3,1,,,,,,,,,,,,,4,15.074794,1
60010205,600102,India,2,Ahmadabad,1,,2,12,,,1,,,,23.5,1,131.5,1,,,,,,,,,,,,,4,13.589903,1
60620301,606203,India,2,Ahmadabad,1,,1,70,,,1,,,,44.2,1,156.1,1,18.13913041337109,,1,,,,3,,,,,,1,,1
60311702,603117,India,2,Ahmadabad,1,,2,45,,,1,0,,,59.8,1,159.8,1,23.417883117351,,2,,,,3,,,,,,3,,1
60931703,609317,India,2,Ahmadabad,1,,1,22,,,1,,,,44.7,1,167.8,1,15.87536101352282,,1,,,,3,,,,,,4,,2
60011601,600116,India,2,Ahmadabad,1,,1,45,,,1,,,,62,1,155.6,1,25.60781385267082,,3,,,,3,,,,,,3,,2
60331503,603315,India,2,Ahmadabad,1,,1,19,,,1,,,,44.8,1,156.8,1,,,,,,,3,,,,,,6,18.221575,1
60940506,609405,India,2,Ahmadabad,1,,1,21,,,1,,,,46,1,165.9,1,16.71340971361573,,1,,,,3,,,,,,5,,1
60921304,609213,India,2,Ahmadabad,1,,1,5.8333335,,,1,,,,16.1,1,107.7,1,,,,,,,,,,,,,3,13.88016,1
60621904,606219,India,2,Ahmadabad,1,,2,33,,,1,0,,,64.8,1,154.3,1,27.21718177003245,,3,,,,3,,,,,,5,,1
60921502,609215,India,2,Ahmadabad,1,,2,28,,,1,0,,,41.7,1,150.1,1,18.50864691138619,,2,,,,3,,,,,,4,,1
60311105,603111,India,2,Ahmadabad,1,,2,9,,,1,,,,21.7,1,124.2,1,,,,,,,,,,,,,3,14.067488,1
60311302,603113,India,2,Ahmadabad,1,,2,52,,,1,,,,55.8,1,163.4,1,20.89922081112947,,2,,,,3,,,,,,3,,1
60010201,600102,India,2,Ahmadabad,1,,1,39,,,1,,,,52.2,1,163,1,19.64695697993903,,2,,,,3,,,,,,6,,2
60941303,609413,India,2,Ahmadabad,1,,2,22,,,1,0,,,42.1,1,158.9,1,16.6737890017153,,1,,,,3,,,,,,4,,1
60611703,606117,India,2,Ahmadabad,1,,1,29,,,1,,,,43.6,1,159.4,1,17.15970649030476,,1,,,,3,,,,,,5,,1
60331102,603311,India,2,Ahmadabad,1,,2,38,,,1,0,,,53.2,1,149.9,1,23.67600192434271,,2,,,,3,,,,,,1,,1
60031304,600313,India,2,Ahmadabad,1,,2,19,,,1,0,,,39.5,1,150.2,1,,,,,,,3,,,,,,6,17.508835,1
60321702,603217,India,2,Ahmadabad,1,,2,60,,,1,,,,41.1,1,151.3,1,17.95411347960766,,1,,,,3,,,,,,1,,1
60011401,600114,India,2,Ahmadabad,1,,1,38,,,1,,,,63.2,1,163.4,1,23.67080206565202,,2,,,,3,,,,,,3,,2
60611702,606117,India,2,Ahmadabad,1,,2,45,,,1,0,,,42.4,1,147.8,1,19.40961801505527,,2,,,,3,,,,,,1,,1
60630704,606307,India,2,Ahmadabad,1,,1,6,,,1,,,,19.1,1,108.4,1,,,,,,,,,,,,,3,16.254545,1
60320902,603209,India,2,Ahmadabad,1,,2,26,,,1,2,,,45.2,1,152.4,1,19.46115003341118,,2,,,,3,,,,,,1,,1
60631303,606313,India,2,Ahmadabad,1,,1,19,,,1,,,,48.2,1,161.5,1,,,,,,,3,,,,,,5,18.480001,1
60640502,606405,India,2,Ahmadabad,1,,2,40,,,1,0,,,36,1,153.4,1,15.29860323752441,,1,,,,3,,,,,,1,,1
60911905,609119,India,2,Ahmadabad,1,,2,11,,,1,,,,23.8,1,130.8,1,,,,,,,,,,,,,4,13.911099,1
60311103,603111,India,2,Ahmadabad,1,,1,18,,,1,,,,53.6,1,172.4,1,,,,,,,3,,,,,,4,18.033926,1
60930103,609301,India,2,Ahmadabad,1,,1,28,,,1,,,,61.4,1,166.2,1,22.22830423380411,,2,,,,3,,,,,,3,,2
60920905,609209,India,2,Ahmadabad,1,,2,65,,,1,,,,50.8,1,142.4,1,25.0520767579851,,3,,,,3,,,,,,1,,1
60941901,609419,India,2,Ahmadabad,1,,1,30,,,1,,,,41.4,1,155.5,1,17.1214110689509,,1,,,,3,,,,,,4,,1
60010601,600106,India,2,Ahmadabad,1,,1,60,,,1,,,,53,1,160.2,1,20.65146407190762,,2,,,,1,,,,,,1,,2
60011602,600116,India,2,Ahmadabad,1,,2,42,,,1,0,,,56.4,1,160.4,1,21.92150546327448,,2,,,,3,,,,,,3,,2
60911101,609111,India,2,Ahmadabad,1,,1,30,,,1,,,,84,1,175.2,1,27.36598486270095,,3,,,,3,,,,,,4,,2
60910302,609103,India,2,Ahmadabad,1,,2,26,,,1,1,,,47.1,1,155.7,1,19.42869729965858,,2,,,,3,,,,,,1,,2
60931302,609313,India,2,Ahmadabad,1,,2,46,,,1,0,,,36.7,1,154.4,1,15.39470858278075,,1,,,,3,,,,,,1,,2
60631904,606319,India,2,Ahmadabad,1,,1,6,,,1,,,,14.3,1,102.3,1,,,,,,,,,,,,,,13.664218,1
60610904,606109,India,2,Ahmadabad,1,,2,31,,,1,0,,,60.2,1,143.9,1,29.07199955957369,,3,,,,3,,,,,,5,,1
60620705,606207,India,2,Ahmadabad,1,,1,65,,,1,,,,72,1,166.7,1,25.90963510957077,,3,,,,3,,,,,,1,,1
60641102,606411,India,2,Ahmadabad,1,,2,34,,,1,0,,,62.3,1,158.4,1,24.83005560657076,,2,,,,3,,,,,,3,,1
60010203,600102,India,2,Ahmadabad,1,,1,17,,,1,,,,39.7,1,157.5,1,,,,,,,,,,,,,5,16.004032,1
60010803,600108,India,2,Ahmadabad,1,,1,23,,,1,,,,51.5,1,169.8,1,17.86207288835615,,1,,,,3,,,,,,1,,2
60640903,606409,India,2,Ahmadabad,1,,1,21,,,1,,,,45.9,1,166.4,1,16.57700397559172,,1,,,,3,,,,,,5,,2
60011403,600114,India,2,Ahmadabad,1,,1,14,,,1,,,,30,1,147.6,1,,,,,,,,,,,,,4,13.770463,1
60011604,600116,India,2,Ahmadabad,1,,1,20,,,1,,,,39.7,1,164.4,1,14.6888190337495,,1,,,,3,,,,,,6,,1
60012003,600120,India,2,Ahmadabad,1,,1,16,,,1,,,,31.6,1,151.3,1,,,,,,,,,,,,,5,13.804136,1
60020104,600201,India,2,Ahmadabad,1,,2,18,,,1,0,,,43.9,1,153.3,1,,,,,,,3,,,,,,3,18.680143,1
60020703,600207,India,2,Ahmadabad,1,,1,1.5,,,1,,0,,8.1,1,77.7,1,,,,,,,,,,,,,,13.416615,1
60020902,600209,India,2,Ahmadabad,1,,2,40,,,1,0,,,92.59999999999999,1,152.7,1,39.71301982348721,,4,,,,3,,,,,,1,,1
60310505,603105,India,2,Ahmadabad,1,,1,6,,,1,,,,15.1,1,119.6,1,,,,,,,,,,,,,3,10.55637,1
60021701,600217,India,2,Ahmadabad,1,,1,40,,,1,,,,67.5,1,171.2,1,23.03012271814133,,2,,,,3,,,,,,4,,2
60310901,603109,India,2,Ahmadabad,1,,1,45,,,1,,,,52.3,1,156.8,1,21.27206112036651,,2,,,,3,,,,,,4,,2
60921302,609213,India,2,Ahmadabad,1,,2,36,,,1,0,,,64.5,1,160.7,1,24.97629188417661,,2,,,,3,,,,,,5,,2
60021905,600219,India,2,Ahmadabad,1,,2,14,,,1,,,,26,1,144.1,1,,,,,,,,,,,,,5,12.521184,1
60030904,600309,India,2,Ahmadabad,1,,2,22,,,1,2,,,47.2,1,153.7,1,19.9799438614374,,2,,,,3,,,,,,3,,1
60031102,600311,India,2,Ahmadabad,1,,2,65,,,1,,,,38.6,1,147.2,1,17.81441989603025,,1,,,,3,,,,,,1,,1
60031105,600311,India,2,Ahmadabad,1,,2,8,,,1,,,,18.2,1,111.4,1,,,,,,,,,,,,,3,14.66564,1
60941102,609411,India,2,Ahmadabad,1,,2,25,,,1,0,,,45,1,160.3,1,17.51239196313524,,1,,,,3,,,,,,4,,2
60620503,606205,India,2,Ahmadabad,1,,2,8,,,1,,,,17.2,1,108.8,1,,,,,,,,,,,,,3,14.530169,1
60911504,609115,India,2,Ahmadabad,1,,1,1.6666667,,,1,,1,,8.5,1,74.59999999999999,1,,,,,,,,,,,,,,15.273595,1
60030905,600309,India,2,Ahmadabad,1,,2,2.25,,,1,,,,10.1,1,82.40000000000001,1,,,,,,,,,,,,,,14.875341,1
60011802,600118,India,2,Ahmadabad,1,,2,47,,,1,0,,,41.3,1,149.7,1,18.4291986332942,,1,,,,3,,,,,,1,,2
60331502,603315,India,2,Ahmadabad,1,,2,42,,,1,0,,,42.9,1,151.4,1,18.71567701889367,,2,,,,3,,,,,,4,,1
60921101,609211,India,2,Ahmadabad,1,,1,31,,,1,,,,51.6,1,169.6,1,17.93899074403702,,1,,,,3,,,,,,5,,1
60330902,603309,India,2,Ahmadabad,1,,2,45,,,1,0,,,56.9,1,148.8,1,25.6984188923575,,3,,,,3,,,,,,1,,1
60021101,600211,India,2,Ahmadabad,1,,1,33,,,1,,,,45.5,1,167.1,1,16.29515503855147,,1,,,,3,,,,,,3,,1
60011203,600112,India,2,Ahmadabad,1,,2,6,,,1,,,,17.6,1,114.1,1,,,,,,,,,,,,,3,13.518901,1
60930306,609303,India,2,Ahmadabad,1,,2,60,,,1,,,,32.4,1,146.2,1,15.15829186636001,,1,,,,3,,,,,,1,,1
60920903,609209,India,2,Ahmadabad,1,,1,13,,,1,,,,31.3,1,132,1,,,,,,,,,,,,,4,17.963728,1
60930704,609307,India,2,Ahmadabad,1,,1,21,,,1,,,,49.2,1,162.4,1,18.65490548181223,,2,,,,3,,,,,,5,,1
60330103,603301,India,2,Ahmadabad,1,,1,24,,,1,,,,55.9,1,148.4,1,25.38306173305919,,3,,,,3,,,,,,5,,1
60330506,603305,India,2,Ahmadabad,1,,2,65,,,1,,,,60.6,1,153.6,1,25.68562825520834,,3,,,,3,,,,,,1,,1
60030901,600309,India,2,Ahmadabad,1,,1,47,,,1,,,,51.8,1,157.1,1,20.98830610998764,,2,,,,1,,,,,,4,,2
60011801,600118,India,2,Ahmadabad,1,,1,50,,,1,,,,50.7,1,150.8,1,22.294887039239,,2,,,,1,,,,,,3,,2
60911702,609117,India,2,Ahmadabad,1,,2,53,,,1,,,,74.8,1,156.4,1,30.57933948626709,,4,,,,3,,,,,,1,,1
60330504,603305,India,2,Ahmadabad,1,,2,22,,,1,0,,,66.3,1,157.3,1,26.79514324893738,,3,,,,3,,,,,,4,,1
60021301,600213,India,2,Ahmadabad,1,,1,46,,,1,,,,72.2,1,168.1,1,25.55063927911809,,3,,,,3,,,,,,6,,1
60310501,603105,India,2,Ahmadabad,1,,1,58,,,1,,,,55.8,1,160.4,1,21.68829795834603,,2,,,,3,,,,,,4,,1
60311303,603113,India,2,Ahmadabad,1,,1,33,,,1,,,,72.90000000000001,1,171.5,1,24.78559103774788,,2,,,,3,,,,,,5,,1
60311304,603113,India,2,Ahmadabad,1,,2,33,,,1,0,,,40.5,1,158.6,1,16.10084455886867,,1,,,,3,,,,,,5,,1
60321105,603211,India,2,Ahmadabad,1,,2,4.6666665,,,1,,,,13.9,1,100,1,,,,,,,,,,,,,,13.9,1
60320102,603201,India,2,Ahmadabad,1,,2,25,,,1,2,,,62.9,1,160.4,1,24.44792009999938,,2,,,,3,,,,,,4,,1
60321102,603211,India,2,Ahmadabad,1,,2,30,,,1,0,,,43,1,151.7,1,18.68518034892619,,2,,,,3,,,,,,1,,1
60321902,603219,India,2,Ahmadabad,1,,2,28,,,1,0,,,56.5,1,145.5,1,26.68839527166661,,3,,,,3,,,,,,5,,2
60330101,603301,India,2,Ahmadabad,1,,1,50,,,1,,,,57.9,1,158.9,1,22.93141052729967,,2,,,,3,,,,,,3,,1
60330501,603305,India,2,Ahmadabad,1,,1,45,,,1,,,,79,1,166.4,1,28.53122688609467,,3,,,,3,,,,,,4,,2
60330904,603309,India,2,Ahmadabad,1,,2,26,,,1,0,,,45.6,1,147.5,1,20.95949439816145,,2,,,,3,,,,,,1,,1
60331301,603313,India,2,Ahmadabad,1,,1,24,,,1,,,,73.7,1,166.3,1,26.64912717780681,,3,,,,3,,,,,,5,,2
60640301,606403,India,2,Ahmadabad,1,,1,47,,,1,,,,79.3,1,161.2,1,30.5170895701593,,4,,,,3,,,,,,5,,1
60321502,603215,India,2,Ahmadabad,1,,2,30,,,1,0,,,33.5,1,139.2,1,17.28885916237284,,1,,,,3,,,,,,1,,1
60310103,603101,India,2,Ahmadabad,1,,1,37,,,1,,,,99.7,1,166.6,1,35.92073083735295,,4,,,,3,,,,,,5,,2
60931101,609311,India,2,Ahmadabad,1,,1,46,,,1,,,,92.59999999999999,1,173.6,1,30.72639045212258,,4,,,,3,,,,,,6,,1
60940703,609407,India,2,Ahmadabad,1,,1,40,,,1,,,,47.3,1,161.9,1,18.0454386434103,,1,,,,3,,,,,,1,,2
60610102,606101,India,2,Ahmadabad,1,,2,30,,,1,0,,,42.9,1,159.7,1,16.82083148232303,,1,,,,3,,,,,,5,,1
60620706,606207,India,2,Ahmadabad,1,,2,60,,,1,,,,57.5,1,156.8,1,23.38706528529779,,2,,,,3,,,,,,1,,1
60921903,609219,India,2,Ahmadabad,1,,2,19,,,1,0,,,51.5,1,157.8,1,,,,,,,3,,,,,,5,20.682034,1
60640304,606403,India,2,Ahmadabad,1,,2,24,,,1,2,,,41.8,1,157.4,1,16.87201006185327,,1,,,,3,,,,,,5,,1
60931902,609319,India,2,Ahmadabad,1,,2,42,,,1,0,,,44.2,1,151.4,1,19.28281874673893,,2,,,,3,,,,,,1,,2
60010602,600106,India,2,Ahmadabad,1,,2,55,,,1,,,,35.5,1,150.2,1,15.73578770250408,,1,,,,3,,,,,,1,,1
60610307,606103,India,2,Ahmadabad,1,,1,18,,,1,,,,38.9,1,157.9,1,,,,,,,3,,,,,,5,15.602182,1
60030304,600303,India,2,Ahmadabad,1,,2,65,,,1,,,,28.6,1,146.4,1,13.34393382901848,,1,,,,3,,,,,,1,,1
60310304,603103,India,2,Ahmadabad,1,,2,15,,,1,0,,,34.6,1,147.5,1,,,,,,,,,,,,,4,15.903476,1
60621906,606219,India,2,Ahmadabad,1,,1,5.25,,,1,,,,12.3,1,98.3,1,,,,,,,,,,,,,,12.729111,1
60320705,603207,India,2,Ahmadabad,1,,2,60,,,1,,,,41.6,1,151.8,1,18.05301685006101,,1,,,,3,,,,,,1,,1
60012001,600120,India,2,Ahmadabad,1,,1,37,,,1,,,,43,1,166.4,1,15.52965514053254,,1,,,,3,,,,,,6,,2
60330907,603309,India,2,Ahmadabad,1,,2,1.0833334,,,1,,1,,6.9,1,67.2,1,,,,,,,,,,,,,,15.27955,1
60031306,600313,India,2,Ahmadabad,1,,2,15,,,1,0,,,32.8,1,143.2,1,,,,,,,,,,,,,5,15.995131,1
60920107,609201,India,2,Ahmadabad,1,,1,19,,,1,,,,39.9,1,154.1,1,,,,,,,3,,,,,,4,16.802258,2
60631902,606319,India,2,Ahmadabad,1,,2,28,,,1,0,,,50.9,1,154.1,1,21.4344579335077,,2,,,,3,,,,,,4,,1
60920702,609207,India,2,Ahmadabad,1,,2,45,,,1,0,,,48.5,1,159.4,1,19.08820561421516,,2,,,,3,,,,,,1,,1
60920503,609205,India,2,Ahmadabad,1,,2,17,,,1,0,,,33.2,1,152.8,1,,,,,,,,,,,,,4,14.21973,1
60631504,606315,India,2,Ahmadabad,1,,2,7,,,1,,,,24.4,1,131.7,1,,,,,,,,,,,,,4,14.067544,1
60931504,609315,India,2,Ahmadabad,1,,2,8.333333,,,1,,,,17.5,1,115.2,1,,,,,,,,,,,,,3,13.186607,1
60610704,606107,India,2,Ahmadabad,1,,2,24,,,1,2,,,63.5,1,158.8,1,25.18098585740662,,3,,,,3,,,,,,5,,1
60610303,606103,India,2,Ahmadabad,1,,1,25,,,1,,,,44.6,1,166.3,1,16.12688021886273,,1,,,,3,,,,,,4,,2
60610501,606105,India,2,Ahmadabad,1,,1,24,,,1,,,,47.5,1,168.3,1,16.76970325392261,,1,,,,1,,,,,,3,,2
60610502,606105,India,2,Ahmadabad,1,,2,21,,,1,2,,,42.3,1,147.3,1,19.49552225185726,,2,,,,3,,,,,,1,,1
60610705,606107,India,2,Ahmadabad,1,,1,2.6666667,,,1,,,,10.3,1,82.2,1,,,,,,,,,,,,,,15.243813,1
60941103,609411,India,2,Ahmadabad,1,,1,6,,,1,,,,15.6,1,109.2,1,,,,,,,,,,,,,1,13.082156,1
60611302,606113,India,2,Ahmadabad,1,,2,22,,,1,0,,,43.5,1,152.8,1,18.63127381376607,,2,,,,3,,,,,,1,,1
60930105,609301,India,2,Ahmadabad,1,,1,3.25,,,1,,,,11.9,1,89.90000000000001,1,,,,,,,,,,,,,,14.72406,1
60621105,606211,India,2,Ahmadabad,1,,2,15,,,1,0,,,39.7,1,162.7,1,,,,,,,,,,,,,5,14.99738,1
60621304,606213,India,2,Ahmadabad,1,,2,3.5833333,,,1,,,,11.3,1,89.8,1,,,,,,,,,,,,,,14.012827,1
60020304,600203,India,2,Ahmadabad,1,,2,20,,,1,2,,,51.9,1,155.6,1,21.4362183702196,,2,,,,3,,,,,,1,,1
60621902,606219,India,2,Ahmadabad,1,,2,55,,,1,,,,35.2,1,148.2,1,16.02677929121569,,1,,,,3,,,,,,3,,1
60621905,606219,India,2,Ahmadabad,1,,2,10,,,1,,,,26,1,128.2,1,,,,,,,,,,,,,4,15.819666,1
60630102,606301,India,2,Ahmadabad,1,,2,50,,,1,,,,50.3,1,148.2,1,22.90190336216333,,2,,,,3,,,,,,3,,1
60610302,606103,India,2,Ahmadabad,1,,2,50,,,1,,,,38.7,1,154.6,1,16.19168274677882,,1,,,,3,,,,,,1,,1
60630903,606309,India,2,Ahmadabad,1,,2,19,,,1,0,,,41.2,1,149.3,1,,,,,,,3,,,,,,4,18.483219,1
60910304,609103,India,2,Ahmadabad,1,,2,6,,,1,,,,14.5,1,106.8,1,,,,,,,,,,,,,3,12.71234,1
60631502,606315,India,2,Ahmadabad,1,,1,30,,,1,,,,49.2,1,162.6,1,18.60904217898268,,2,,,,3,,,,,,4,,2
60631702,606317,India,2,Ahmadabad,1,,2,35,,,1,0,,,64,1,154.5,1,26.81161697091568,,3,,,,3,,,,,,1,,1
60610503,606105,India,2,Ahmadabad,1,,2,1,,,1,,0,,6.8,1,66.90000000000001,1,,,,,,,,,,,,,,15.19346,1
60640101,606401,India,2,Ahmadabad,1,,1,32,,,1,,,,59.2,1,156.1,1,24.29494390207168,,2,,,,3,,,,,,5,,1