id,hh_id,country,sec_area,tert_area,round,smpl_weight,sex,age,edc_level,edc,residence,preg_lact,breastfeeding,hh_head,wgt,wgt_method,hgt,hgt_method,bmi_adults,bmi_children,bmi_cat,misrep,pa,pa_cat,smok,special_diet,special_diet_other,clin_diet,clin_diet_other,note,bmi_chld
230004502,,Germany,North Rhine-Westfalia,Ruhr Area,,1,2,9.9899998,,,2,,,,27.799999,1,143.3,1,,,,2,386.57144,1,3,5,Sugar reduced diet,0,,,13.537933
230004503,,Germany,North Rhine-Westfalia,Ruhr Area,,1,1,9.9899998,,,2,,,,37.700001,1,140.2,1,,,,2,1244.1428,2,3,,,,,,19.179857
230004504,,Germany,North Rhine-Westfalia,Ruhr Area,,1,1,9.9899998,,,2,,,,36.150002,1,140.7,1,,,,2,520.78571,1,3,,,,,,18.260815
230004505,,Germany,North Rhine-Westfalia,Ruhr Area,,1,2,9.9899998,,,2,,,,37.5,1,139,1,,,,2,227.78572,1,3,,,,,,19.408934
230004506,,Germany,North Rhine-Westfalia,Ruhr Area,,1,1,9.9899998,,,2,,,,40.75,1,141.2,1,,,,2,394.42856,1,3,,,,,,20.438934
230004507,,Germany,North Rhine-Westfalia,Ruhr Area,,1,1,9.9899998,,,2,,,,37.299999,1,156.89999,1,,,,2,504.85715,1,3,,,,,,15.151756
230004508,,Germany,North Rhine-Westfalia,Ruhr Area,,1,1,9.9899998,,,2,,,,41.349998,1,152.60001,1,,,,2,616.07141,2,3,,,,,,17.756868
230004509,,Germany,North Rhine-Westfalia,Ruhr Area,,1,2,9.9899998,,,2,,,,42.049999,1,150.89999,1,,,,2,852.85712,2,3,,,,,,18.466625
230004510,,Germany,North Rhine-Westfalia,Ruhr Area,,1,1,9.9899998,,,2,,,,31.4,1,139.89999,1,,,,2,453,1,3,,,,,,16.04332
230004511,,Germany,North Rhine-Westfalia,Ruhr Area,,1,2,9.9899998,,,2,,,,32.75,1,140.5,1,,,,2,421.28571,1,3,,,,,,16.590469
230004512,,Germany,North Rhine-Westfalia,Ruhr Area,,1,1,9.9899998,,,2,,,,29.799999,1,137.10001,1,,,,2,592.28571,1,3,,,,,,15.85409
230004513,,Germany,North Rhine-Westfalia,Ruhr Area,,1,2,9.9899998,,,2,,,,35.700001,1,142.60001,1,,,,2,428.57144,1,3,,,,,,17.556145
230004514,,Germany,North Rhine-Westfalia,Ruhr Area,,1,2,9.9899998,,,2,,,,28.6,1,138.2,1,,,,2,168.85715,1,3,,,,,,14.974419
230004515,,Germany,North Rhine-Westfalia,Ruhr Area,,1,2,9.9899998,,,2,,,,47.099998,1,149.60001,1,,,,2,752.71429,2,3,,,,,,21.045424
230004516,,Germany,North Rhine-Westfalia,Ruhr Area,,1,1,9.9899998,,,2,,,,44.849998,1,148.2,1,,,,2,993.85712,2,3,,,,,,20.420485
230004517,,Germany,North Rhine-Westfalia,Ruhr Area,,1,2,9.9899998,,,2,,,,32.599998,1,144.89999,1,,,,2,0,1,3,,,,,,15.52676
230004518,,Germany,North Rhine-Westfalia,Ruhr Area,,1,1,9.9899998,,,2,,,,34.950001,1,147,1,,,,2,835.71429,2,3,,,,,,16.173817
230004519,,Germany,North Rhine-Westfalia,Ruhr Area,,1,1,9,,,2,,,,26.6,1,130.89999,1,,,,2,571.71429,1,3,5,Sugar reduced diet,0,,,15.523955
230004520,,Germany,North Rhine-Westfalia,Ruhr Area,,1,2,9,,,2,,,,31.700001,1,138.8,1,,,,2,334.28571,1,3,0,,0,,,16.454334
230004521,,Germany,North Rhine-Westfalia,Ruhr Area,,1,2,9.9899998,,,2,,,,35.099998,1,144.5,1,,,,2,373.28571,1,3,,,,,,16.810143
230004522,,Germany,North Rhine-Westfalia,Ruhr Area,,1,2,9,,,2,,,,28.799999,1,132.89999,1,,,,2,394.71429,1,3,5,Sugar reduced diet,0,,,16.305817
230004523,,Germany,North Rhine-Westfalia,Ruhr Area,,1,1,9,,,2,,,,28.200001,1,134.39999,1,,,,1,895,2,3,0,,0,,,15.611715
230004524,,Germany,North Rhine-Westfalia,Ruhr Area,,1,2,9,,,2,,,,36.799999,1,150.8,1,,,,2,343.71429,1,3,5,Sugar reduced diet,0,,,16.182482
230004525,,Germany,North Rhine-Westfalia,Ruhr Area,,1,2,9,,,2,,,,35.099998,1,137.3,1,,,,2,255.21428,1,3,0,,0,,,18.619413
230004526,,Germany,North Rhine-Westfalia,Ruhr Area,,1,2,9,,,2,,,,23.799999,1,130.2,1,,,,2,1641.4286,2,3,0,,0,,,14.039608
230004527,,Germany,North Rhine-Westfalia,Ruhr Area,,1,2,9,,,2,,,,40.549999,1,142.89999,1,,,,2,,,3,5,Sugar reduced diet,0,,,19.857586
230004528,,Germany,North Rhine-Westfalia,Ruhr Area,,1,2,9,,,2,,,,29.75,1,138.60001,1,,,,2,282.85715,1,3,0,,0,,,15.486756
230004529,,Germany,North Rhine-Westfalia,Ruhr Area,,1,2,9,,,2,,,,27.75,1,137.89999,1,,,,2,14.285714,1,3,5,Sugar reduced diet,0,,,14.592661
230004530,,Germany,North Rhine-Westfalia,Ruhr Area,,1,1,8,,,2,,,,43.400002,1,136.60001,1,,,,2,1090.5714,2,3,,,,,,23.258854
230004531,,Germany,North Rhine-Westfalia,Ruhr Area,,1,1,9,,,2,,,,32.400002,1,139.60001,1,,,,2,1022.5714,2,3,0,,0,,,16.625479
230004532,,Germany,North Rhine-Westfalia,Ruhr Area,,1,2,9,,,2,,,,27.549999,1,131.3,1,,,,2,936.78571,2,3,0,,0,,,15.980564
230004533,,Germany,North Rhine-Westfalia,Ruhr Area,,1,1,9,,,2,,,,44.099998,1,141,1,,,,2,537.85712,1,3,0,,0,,,22.181982
230004534,,Germany,North Rhine-Westfalia,Ruhr Area,,1,1,9,,,2,,,,27.549999,1,138,1,,,,2,169.71428,1,3,0,,0,,,14.466498
230004535,,Germany,North Rhine-Westfalia,Ruhr Area,,1,1,9,,,2,,,,30.799999,1,138.89999,1,,,,2,1394.1428,2,3,5,Sugar reduced diet,0,,,15.964167
230004536,,Germany,North Rhine-Westfalia,Ruhr Area,,1,1,9,,,2,,,,28.799999,1,136,1,,,,2,542.78571,1,3,0,,0,,,15.570934
230004537,,Germany,North Rhine-Westfalia,Ruhr Area,,1,2,9,,,2,,,,32.25,1,143.10001,1,,,,1,211.07143,1,3,0,,0,,,15.748907
230004538,,Germany,North Rhine-Westfalia,Ruhr Area,,1,1,9,,,2,,,,33.099998,1,139.2,1,,,,2,846.28571,2,3,0,,0,,,17.082424
230004539,,Germany,North Rhine-Westfalia,Ruhr Area,,1,2,9,,,2,,,,23.049999,1,123.7,1,,,,2,418.28571,1,3,5,Sugar reduced diet,0,,,15.063696
230004540,,Germany,North Rhine-Westfalia,Ruhr Area,,1,1,9,,,2,,,,30.85,1,137.89999,1,,,,2,1444.2858,2,3,0,,0,,,16.222832
230004541,,Germany,North Rhine-Westfalia,Ruhr Area,,1,1,9,,,2,,,,28.85,1,137.5,1,,,,2,826.71429,2,3,0,,0,,,15.259504
230004542,,Germany,North Rhine-Westfalia,Ruhr Area,,1,2,9,,,2,,,,29.549999,1,141.60001,1,,,,2,283.71429,1,3,0,,0,,,14.737741
230004543,,Germany,North Rhine-Westfalia,Ruhr Area,,1,2,9,,,2,,,,33.5,1,142.7,1,,,,2,216,1,3,0,,0,,,16.451174
230004544,,Germany,North Rhine-Westfalia,Ruhr Area,,1,1,8,,,2,,,,26.299999,1,131.5,1,,,,2,529.85712,1,3,,,,,,15.209125
230004545,,Germany,North Rhine-Westfalia,Ruhr Area,,1,2,8,,,2,,,,25.200001,1,124.8,1,,,,1,289.5,1,3,,,,,,16.179733
230004546,,Germany,North Rhine-Westfalia,Ruhr Area,,1,1,8,,,2,,,,24.200001,1,126.1,1,,,,2,665.57141,2,3,,,,,,15.218968
230004547,,Germany,North Rhine-Westfalia,Ruhr Area,,1,2,8,,,2,,,,31.700001,1,138,1,,,,2,297.42856,1,3,,,,,,16.645662
230004548,,Germany,North Rhine-Westfalia,Ruhr Area,,1,1,9,,,2,,,,29.049999,1,130.8,1,,,,2,,,3,0,,0,,,16.979723
230004549,,Germany,North Rhine-Westfalia,Ruhr Area,,1,1,8,,,2,,,,31.4,1,130.10001,1,,,,2,389.85715,1,3,,,,,,18.551329
230004550,,Germany,North Rhine-Westfalia,Ruhr Area,,1,2,8,,,2,,,,28.049999,1,136.3,1,,,,2,525.42859,1,3,,,,,,15.098755
230004551,,Germany,North Rhine-Westfalia,Ruhr Area,,1,2,8,,,2,,,,28.9,1,131.8,1,,,,2,1122.4286,2,3,,,,,,16.636692
230004552,,Germany,North Rhine-Westfalia,Ruhr Area,,1,1,8,,,2,,,,28.35,1,135.5,1,,,,2,488.57144,1,3,,,,,,15.440967
230004553,,Germany,North Rhine-Westfalia,Ruhr Area,,1,2,8,,,2,,,,36.799999,1,149,1,,,,2,185.78572,1,3,,,,,,16.57583
230004554,,Germany,North Rhine-Westfalia,Ruhr Area,,1,2,8,,,2,,,,27.15,1,135.2,1,,,,2,54.285713,1,3,,,,,,14.853078
230004555,,Germany,North Rhine-Westfalia,Ruhr Area,,1,1,8,,,2,,,,24,1,124.1,1,,,,2,414.85715,1,3,,,,,,15.583596
230004556,,Germany,North Rhine-Westfalia,Ruhr Area,,1,1,8,,,2,,,,22.549999,1,122.3,1,,,,2,544.28571,1,3,,,,,,15.07626
230004557,,Germany,North Rhine-Westfalia,Ruhr Area,,1,2,8,,,2,,,,26.75,1,130,1,,,,2,333.42856,1,3,,,,,,15.828403
230004558,,Germany,North Rhine-Westfalia,Ruhr Area,,1,2,8,,,2,,,,38.75,1,136.5,1,,,,2,510.64285,1,3,,,,,,20.797274
230004559,,Germany,North Rhine-Westfalia,Ruhr Area,,1,1,8,,,2,,,,31.200001,1,129,1,,,,2,794.28571,2,3,,,,,,18.748875
230004560,,Germany,North Rhine-Westfalia,Ruhr Area,,1,2,8,,,2,,,,31.5,1,142.8,1,,,,2,192.85715,1,3,,,,,,15.447354
230004561,,Germany,North Rhine-Westfalia,Ruhr Area,,1,1,8,,,2,,,,31.75,1,135.7,1,,,,2,211.71428,1,3,,,,,,17.241858
230004562,,Germany,North Rhine-Westfalia,Ruhr Area,,1,1,8,,,2,,,,45.049999,1,143.39999,1,,,,2,694.07141,2,3,,,,,,21.907686
230004563,,Germany,North Rhine-Westfalia,Ruhr Area,,1,1,7,,,2,,,,25.700001,1,127.2,1,,,,2,405,1,3,0,,0,,,15.883965
230004564,,Germany,North Rhine-Westfalia,Ruhr Area,,1,1,8,,,2,,,,27.299999,1,131,1,,,,2,555.85712,1,3,,,,,,15.908163
230004565,,Germany,North Rhine-Westfalia,Ruhr Area,,1,1,8,,,2,,,,26.049999,1,129.8,1,,,,2,795.42859,2,3,,,,,,15.461738
230004566,,Germany,North Rhine-Westfalia,Ruhr Area,,1,1,7,,,2,,,,27.1,1,122.6,1,,,,2,578.28571,1,3,5,Sugar reduced diet,0,,,18.029694
230004567,,Germany,North Rhine-Westfalia,Ruhr Area,,1,2,8,,,2,,,,29.049999,1,125,1,,,,2,596.14288,1,3,,,,,,18.591999
230004568,,Germany,North Rhine-Westfalia,Ruhr Area,,1,2,7,,,2,,,,28.549999,1,132.2,1,,,,2,284.57144,1,3,5,Sugar reduced diet,0,,,16.335905
230004569,,Germany,North Rhine-Westfalia,Ruhr Area,,1,1,7,,,2,,,,30.700001,1,127.7,1,,,,2,373.92856,1,3,5,Sugar reduced diet,0,,,18.825937
230004570,,Germany,North Rhine-Westfalia,Ruhr Area,,1,2,8,,,2,,,,31.200001,1,135.60001,1,,,,2,625.71429,2,3,,,,,,16.968178
230004571,,Germany,North Rhine-Westfalia,Ruhr Area,,1,1,7,,,2,,,,35.900002,1,133.2,1,,,,2,1190.5714,2,3,,,,,,20.2342
230004572,,Germany,North Rhine-Westfalia,Ruhr Area,,1,2,7,,,2,,,,30,1,132.5,1,,,,2,775.85712,2,3,5,Sugar reduced diet,0,,,17.087933
230004573,,Germany,North Rhine-Westfalia,Ruhr Area,,1,1,7,,,2,,,,30.799999,1,127.8,1,,,,2,476.14285,1,3,,,,,,18.857712
230004574,,Germany,North Rhine-Westfalia,Ruhr Area,,1,1,7,,,2,,,,33.150002,1,138.39999,1,,,,2,813.64288,2,3,5,Sugar reduced diet,0,,,17.306585
230004575,,Germany,North Rhine-Westfalia,Ruhr Area,,1,1,7,,,2,,,,21.700001,1,125.4,1,,,,2,355.71429,1,3,,,,,,13.799541
230004576,,Germany,North Rhine-Westfalia,Ruhr Area,,1,2,7,,,2,,,,23.299999,1,127.1,1,,,,2,483,1,3,0,,0,,,14.423306
230004577,,Germany,North Rhine-Westfalia,Ruhr Area,,1,2,7,,,2,,,,17.4,1,110.8,1,,,,2,242.57143,1,3,0,,0,,,14.173258
230004578,,Germany,North Rhine-Westfalia,Ruhr Area,,1,1,7,,,2,,,,24.950001,1,127.8,1,,,,2,375.28571,1,3,0,,0,,,15.275971
230004579,,Germany,North Rhine-Westfalia,Ruhr Area,,1,1,7,,,2,,,,30.5,1,122.8,1,,,,2,796.92859,2,3,0,,0,,,20.225677
230004580,,Germany,North Rhine-Westfalia,Ruhr Area,,1,1,7,,,2,,,,28.450001,1,129.7,1,,,,2,920.57141,2,3,0,,0,,,16.912287
230004581,,Germany,North Rhine-Westfalia,Ruhr Area,,1,1,7,,,2,,,,26.75,1,131.2,1,,,,2,452.14285,1,3,0,,0,,,15.540183
230004582,,Germany,North Rhine-Westfalia,Ruhr Area,,1,2,7,,,2,,,,22.950001,1,125,1,,,,2,367.28571,1,3,5,Sugar reduced diet,0,,,14.688001
230004583,,Germany,North Rhine-Westfalia,Ruhr Area,,1,2,7,,,2,,,,24.049999,1,121.2,1,,,,2,828.64288,2,3,5,Sugar reduced diet,0,,,16.372305
230004584,,Germany,North Rhine-Westfalia,Ruhr Area,,1,1,7,,,2,,,,28.299999,1,136.89999,1,,,,2,520.71429,1,3,5,Sugar reduced diet,0,,,15.100091
230004585,,Germany,North Rhine-Westfalia,Ruhr Area,,1,2,7,,,2,,,,24.700001,1,122.4,1,,,,2,905.42859,2,3,0,,0,,,16.486715
230004586,,Germany,North Rhine-Westfalia,Ruhr Area,,1,2,7,,,2,,,,20,1,117.8,1,,,,2,1140,2,3,5,Sugar reduced diet,0,,,14.412502
230004587,,Germany,North Rhine-Westfalia,Ruhr Area,,1,1,6,,,2,,,,22.1,1,120.6,1,,,,2,359.85715,1,3,,,,,,15.194894
230004588,,Germany,North Rhine-Westfalia,Ruhr Area,,1,1,7,,,2,,,,25.15,1,127.2,1,,,,2,393.71429,1,3,0,,0,,,15.544036
230004589,,Germany,North Rhine-Westfalia,Ruhr Area,,1,2,7,,,2,,,,22.1,1,126.1,1,,,,2,387.42856,1,3,5,Sugar reduced diet,0,,,13.898314
230004590,,Germany,North Rhine-Westfalia,Ruhr Area,,1,2,7,,,2,,,,26.549999,1,128.7,1,,,,2,435.14285,1,3,0,,0,,,16.029037
230004591,,Germany,North Rhine-Westfalia,Ruhr Area,,1,1,7,,,2,,,,22.25,1,123.8,1,,,,2,505.42856,1,3,5,Sugar reduced diet,0,,,14.517395
230004592,,Germany,North Rhine-Westfalia,Ruhr Area,,1,2,6,,,2,,,,22.200001,1,114.5,1,,,,2,1553.5714,2,3,,,,,,16.933315
230004593,,Germany,North Rhine-Westfalia,Ruhr Area,,1,2,5,,,2,,0,,21.5,1,119,1,,,,2,895.92859,2,3,,,,,,15.182544
230004594,,Germany,North Rhine-Westfalia,Ruhr Area,,1,2,6,,,2,,,,28.700001,1,130.2,1,,,,2,914.57141,2,3,,,,,,16.930117
230004595,,Germany,North Rhine-Westfalia,Ruhr Area,,1,2,7,,,2,,,,24.35,1,121.8,1,,,,2,68.14286,1,3,0,,0,,,16.41362
230004596,,Germany,North Rhine-Westfalia,Ruhr Area,,1,1,6,,,2,,,,21.9,1,120.6,1,,,,2,695.35712,2,3,,,,,,15.057384
230004597,,Germany,North Rhine-Westfalia,Ruhr Area,,1,2,8,,,2,,,,30.700001,1,132.60001,1,,,,2,329.78571,1,3,,,,,,17.460283
230004598,,Germany,North Rhine-Westfalia,Ruhr Area,,1,2,8,,,2,,,,19.85,1,125.1,1,,,,2,180.21428,1,3,,,,,,12.683699
230004599,,Germany,North Rhine-Westfalia,Ruhr Area,,1,1,7,,,2,,,,28.75,1,127,1,,,,2,387.42856,1,3,0,,0,,,17.825035
230004600,,Germany,North Rhine-Westfalia,Ruhr Area,,1,1,6,,,2,,,,19.9,1,112.6,1,,,,2,869.14288,2,3,,,,,,15.695541
230004601,,Germany,North Rhine-Westfalia,Ruhr Area,,1,2,6,,,2,,,,25.9,1,126.3,1,,,,2,393,1,3,,,,,,16.236523
230004602,,Germany,North Rhine-Westfalia,Ruhr Area,,1,1,6,,,2,,,,31.5,1,130.5,1,,,,2,298.5,1,3,,,,,,18.496498
230004603,,Germany,North Rhine-Westfalia,Ruhr Area,,1,1,6,,,2,,,,19.200001,1,117.4,1,,,,2,404.35715,1,3,,,,,,13.930447
230004604,,Germany,North Rhine-Westfalia,Ruhr Area,,1,1,6,,,2,,,,21.5,1,119.6,1,,,,2,507.42856,1,3,,,,,,15.030593
230004605,,Germany,North Rhine-Westfalia,Ruhr Area,,1,2,6,,,2,,,,17.700001,1,108.5,1,,,,2,397.28571,1,3,,,,,,15.035359
230004606,,Germany,North Rhine-Westfalia,Ruhr Area,,1,1,6,,,2,,,,19.15,1,123.8,1,,,,2,168.85715,1,3,,,,,,12.494747
230004607,,Germany,North Rhine-Westfalia,Ruhr Area,,1,1,6,,,2,,,,27.200001,1,127.5,1,,,,2,253.92857,1,3,,,,,,16.732027
230004608,,Germany,North Rhine-Westfalia,Ruhr Area,,1,2,6,,,2,,,,19.299999,1,116.2,1,,,,2,414.85715,1,3,,,,,,14.293713
230004609,,Germany,North Rhine-Westfalia,Ruhr Area,,1,2,6,,,2,,,,20.049999,1,116.2,1,,,,2,414.85715,1,3,,,,,,14.849168
230004610,,Germany,North Rhine-Westfalia,Ruhr Area,,1,2,6,,,2,,,,20.15,1,113.3,1,,,,2,399.85715,1,3,,,,,,15.696947
230004611,,Germany,North Rhine-Westfalia,Ruhr Area,,1,2,5,,,2,,0,,24.049999,1,125.1,1,,,,2,994.28571,2,3,,,,,,15.367402
230004612,,Germany,North Rhine-Westfalia,Ruhr Area,,1,1,5,,,2,,0,,19.299999,1,109.6,1,,,,2,197.14285,1,3,5,Sugar reduced diet,0,,,16.067051
230004613,,Germany,North Rhine-Westfalia,Ruhr Area,,1,2,6,,,2,,,,22.35,1,120.6,1,,,,2,898.28571,2,3,,,,,,15.366782
230004614,,Germany,North Rhine-Westfalia,Ruhr Area,,1,1,6,,,2,,,,23.299999,1,123.8,1,,,,2,283.96429,1,3,,,,,,15.202485
230004615,,Germany,North Rhine-Westfalia,Ruhr Area,,1,2,5,,,2,,0,,19.200001,1,109.8,1,,,,2,510.21429,1,3,0,,0,,,15.925627
230004616,,Germany,North Rhine-Westfalia,Ruhr Area,,1,2,6,,,2,,,,21.4,1,116.3,1,,,,2,569.57141,1,3,,,,,,15.821743
230004617,,Germany,North Rhine-Westfalia,Ruhr Area,,1,1,6,,,2,,,,22.65,1,117.3,1,,,,2,40.285713,1,3,,,,,,16.461603
230004618,,Germany,North Rhine-Westfalia,Ruhr Area,,1,2,5,,,2,,0,,21.35,1,116.7,1,,,,2,732,2,3,,,,,,15.676756
230004619,,Germany,North Rhine-Westfalia,Ruhr Area,,1,2,6,,,2,,,,20.1,1,112.8,1,,,,1,1162.5714,2,3,,,,,,15.797117
230004620,,Germany,North Rhine-Westfalia,Ruhr Area,,1,1,6,,,2,,,,20.9,1,116.6,1,,,,2,402.85715,1,3,,,,,,15.372666
230004621,,Germany,North Rhine-Westfalia,Ruhr Area,,1,2,5,,,2,,0,,20.799999,1,115.4,1,,,,2,668.57141,2,3,0,,0,,,15.618945
230004622,,Germany,North Rhine-Westfalia,Ruhr Area,,1,1,5,,,2,,0,,19.6,1,115,1,,,,2,545.35712,1,3,0,,0,,,14.820416
230004623,,Germany,North Rhine-Westfalia,Ruhr Area,,1,2,5,,,2,,0,,21.950001,1,113.3,1,,,,2,321.42856,1,3,,,,,,17.099157
230004624,,Germany,North Rhine-Westfalia,Ruhr Area,,1,1,5,,,2,,0,,20.799999,1,115.4,1,,,,2,525.42859,1,3,0,,0,,,15.618945
230004625,,Germany,North Rhine-Westfalia,Ruhr Area,,1,1,5,,,2,,0,,21.9,1,118.7,1,,,,2,1065.4286,2,3,0,,0,,,15.543281
230004626,,Germany,North Rhine-Westfalia,Ruhr Area,,1,1,6,,,2,,,,25.15,1,125.1,1,,,,2,440.28571,1,3,,,,,,16.070278
230004627,,Germany,North Rhine-Westfalia,Ruhr Area,,1,2,5,,,2,,0,,16.75,1,106.5,1,,,,2,544.28571,1,3,0,,0,,,14.767793
230004628,,Germany,North Rhine-Westfalia,Ruhr Area,,1,2,5,,,2,,0,,18.4,1,114.3,1,,,,2,795,2,3,,,,,,14.083978
230004629,,Germany,North Rhine-Westfalia,Ruhr Area,,1,2,5,,,2,,0,,23.6,1,116.6,1,,,,2,337.5,1,3,5,Sugar reduced diet,0,,,17.358608
230004630,,Germany,North Rhine-Westfalia,Ruhr Area,,1,2,5,,,2,,0,,20.25,1,110.1,1,,,,2,707.78571,2,3,5,Sugar reduced diet,0,,,16.705151
230004631,,Germany,North Rhine-Westfalia,Ruhr Area,,1,1,5,,,2,,0,,17.200001,1,110,1,,,,2,412.07144,1,3,0,,0,,,14.214877
230004632,,Germany,North Rhine-Westfalia,Ruhr Area,,1,1,5,,,2,,0,,20.6,1,115.1,1,,,,2,813.42859,2,3,5,Sugar reduced diet,0,,,15.549506
230004633,,Germany,North Rhine-Westfalia,Ruhr Area,,1,2,5,,,2,,0,,17.6,1,109.2,1,,,,2,377.14285,1,3,0,,0,,,14.759356
230004634,,Germany,North Rhine-Westfalia,Ruhr Area,,1,2,6,,,2,,,,20.4,1,116.8,1,,,,1,463.07144,1,3,,,,,,14.953555
230004635,,Germany,North Rhine-Westfalia,Ruhr Area,,1,1,5,,,2,,0,,18.85,1,111.3,1,,,,2,566.85712,1,3,5,Sugar reduced diet,0,,,15.216719
230004636,,Germany,North Rhine-Westfalia,Ruhr Area,,1,2,5,,,2,,0,,22,1,117.8,1,,,,2,278.57144,1,3,0,,0,,,15.853753
230004637,,Germany,North Rhine-Westfalia,Ruhr Area,,1,2,5,,,2,,0,,16.65,1,109.5,1,,,,2,322.71429,1,3,0,,0,,,13.886282
230004638,,Germany,North Rhine-Westfalia,Ruhr Area,,1,2,5,,,2,,0,,18.5,1,112.4,1,,,,2,341.57144,1,3,0,,0,,,14.643305
230004639,,Germany,North Rhine-Westfalia,Ruhr Area,,1,2,5,,,2,,0,,18,1,107,1,,,,2,528,1,3,5,Sugar reduced diet,0,,,15.721897
230004640,,Germany,North Rhine-Westfalia,Ruhr Area,,1,1,5,,,2,,0,,18,1,111.2,1,,,,2,741.64288,2,3,0,,0,,,14.556701
230004641,,Germany,North Rhine-Westfalia,Ruhr Area,,1,2,5,,,2,,0,,16.65,1,110.1,1,,,,2,1211.1428,2,3,5,Sugar reduced diet,0,,,13.735346
230004642,,Germany,North Rhine-Westfalia,Ruhr Area,,1,1,5,,,2,,0,,19.299999,1,114.3,1,,,,2,590.57141,1,3,5,Sugar reduced diet,0,,,14.772867
230004643,,Germany,North Rhine-Westfalia,Ruhr Area,,1,2,5,,,2,,0,,20.700001,1,116.1,1,,,,2,221.78572,1,3,0,,0,,,15.356984
230004644,,Germany,North Rhine-Westfalia,Ruhr Area,,1,2,4,,,2,,0,,18,1,110.8,1,,,,2,1108.2858,2,3,,,,,,14.661991
230004645,,Germany,North Rhine-Westfalia,Ruhr Area,,1,2,5,,,2,,0,,16.65,1,106.6,1,,,,2,621.42859,2,3,5,Sugar reduced diet,0,,,14.652099
230004646,,Germany,North Rhine-Westfalia,Ruhr Area,,1,2,4,,,2,,0,,21.200001,1,107.6,1,,,,2,1419.9286,2,3,,,,,,18.31097
230004647,,Germany,North Rhine-Westfalia,Ruhr Area,,1,1,5,,,2,,0,,20.5,1,113.5,1,,,,2,478.92856,1,3,5,Sugar reduced diet,6,Allergy related diet,,15.913369
230004648,,Germany,North Rhine-Westfalia,Ruhr Area,,1,2,4,,,2,,0,,21.1,1,114.8,1,,,,2,204.64285,1,3,5,Sugar reduced diet,0,,,16.010271
230004649,,Germany,North Rhine-Westfalia,Ruhr Area,,1,2,5,,,2,,0,,16.700001,1,109.7,1,,,,2,673.71429,2,3,5,Sugar reduced diet,0,,,13.877245
230004650,,Germany,North Rhine-Westfalia,Ruhr Area,,1,2,4,,,2,,0,,15.8,1,99.900002,1,,,,2,471.21429,1,3,,,,,,15.831647
230004651,,Germany,North Rhine-Westfalia,Ruhr Area,,1,2,5,,,2,,0,,23.65,1,118.1,1,,,,2,751.14288,2,3,5,Sugar reduced diet,0,,,16.95631
230004652,,Germany,North Rhine-Westfalia,Ruhr Area,,1,2,4,,,2,,0,,16.9,1,107.8,1,,,,2,714.42859,2,3,,,,,,14.542837
230004653,,Germany,North Rhine-Westfalia,Ruhr Area,,1,2,4,,,2,,0,,21,1,108.1,1,,,,2,355.71429,1,3,,,,,,17.970821
230004654,,Germany,North Rhine-Westfalia,Ruhr Area,,1,1,4,,,2,,0,,15.65,1,101.5,1,,,,2,606.42859,2,3,,,,,,15.190856
230004655,,Germany,North Rhine-Westfalia,Ruhr Area,,1,1,4,,,2,,0,,16.1,1,101.3,1,,,,2,565.71429,1,3,,,,,,15.689423
230004656,,Germany,North Rhine-Westfalia,Ruhr Area,,1,2,4,,,2,,0,,15.9,1,104.4,1,,,,2,276.42856,1,3,,,,,,14.588012
230004657,,Germany,North Rhine-Westfalia,Ruhr Area,,1,1,4,,,2,,0,,16.5,1,105.5,1,,,,2,462,1,3,,,,,,14.824465
230004658,,Germany,North Rhine-Westfalia,Ruhr Area,,1,2,4,,,2,,0,,16.299999,1,102.8,1,,,,1,625.28571,2,3,,,,,,15.424153
230004659,,Germany,North Rhine-Westfalia,Ruhr Area,,1,1,4,,,2,,0,,18.4,1,109.1,1,,,,2,942.85712,2,3,,,,,,15.458534
230004660,,Germany,North Rhine-Westfalia,Ruhr Area,,1,1,4,,,2,,0,,18.200001,1,106.3,1,,,,2,257.14285,1,3,,,,,,16.106636
230004661,,Germany,North Rhine-Westfalia,Ruhr Area,,1,2,4,,,2,,0,,12.6,1,96,1,,,,2,777.85712,2,3,,,,,,13.671875
230004662,,Germany,North Rhine-Westfalia,Ruhr Area,,1,2,3,,,2,,0,,15.1,1,102.3,1,,,,1,634.28571,2,3,,,,,,14.428649
230004663,,Germany,North Rhine-Westfalia,Ruhr Area,,1,1,4,,,2,,0,,16.1,1,106.7,1,,,,2,437.14285,1,3,,,,,,14.141552
230004664,,Germany,North Rhine-Westfalia,Ruhr Area,,1,1,3,,,2,,0,,15.9,1,107,1,,,,2,606,2,3,,,,,,13.887675
230004665,,Germany,North Rhine-Westfalia,Ruhr Area,,1,2,4,,,2,,0,,14.35,1,97,1,,,,2,150,1,3,,,,,,15.251355
230004666,,Germany,North Rhine-Westfalia,Ruhr Area,,1,2,4,,,2,,0,,17.75,1,108.1,1,,,,2,590.78571,1,3,,,,,,15.189623
230004667,,Germany,North Rhine-Westfalia,Ruhr Area,,1,2,4,,,2,,0,,15.15,1,99.800003,1,,,,2,40.285713,1,3,,,,,,15.210781
230004668,,Germany,North Rhine-Westfalia,Ruhr Area,,1,2,3,,,2,,0,,16.299999,1,103.8,1,,,,2,1214.1428,2,3,,,,,,15.128395
230004669,,Germany,North Rhine-Westfalia,Ruhr Area,,1,1,4,,,2,,0,,17.200001,1,102.1,1,,,,2,334.28571,1,3,,,,,,16.499737
230004670,,Germany,North Rhine-Westfalia,Ruhr Area,,1,2,4,,,2,,0,,17.200001,1,103.1,1,,,,2,183.21428,1,3,,,,,,16.181215
230004671,,Germany,North Rhine-Westfalia,Ruhr Area,,1,1,4,,,2,,0,,15.65,1,106.4,1,,,,2,321.42856,1,3,,,,,,13.823915
230004672,,Germany,North Rhine-Westfalia,Ruhr Area,,1,2,4,,,2,,0,,18.15,1,109.1,1,,,,2,734.57141,2,3,,,,,,15.2485
230004673,,Germany,North Rhine-Westfalia,Ruhr Area,,1,1,4,,,2,,0,,16.799999,1,105.7,1,,,,2,922,2,3,,,,,,15.036935
230004674,,Germany,North Rhine-Westfalia,Ruhr Area,,1,2,4,,,2,,0,,16.799999,1,98.400002,1,,,,1,72.85714,1,3,,,,,,17.350782
230004675,,Germany,North Rhine-Westfalia,Ruhr Area,,1,1,4,,,2,,0,,16.9,1,104.3,1,,,,2,634.28571,2,3,,,,,,15.535243
230004676,,Germany,North Rhine-Westfalia,Ruhr Area,,1,2,3,,,2,,0,,14.3,1,95,1,,,,2,705.42859,2,3,0,,0,,,15.844875
230004677,,Germany,North Rhine-Westfalia,Ruhr Area,,1,1,4,,,2,,0,,17.6,1,106.2,1,,,,2,67.5,1,3,,,,,,15.604997
230004678,,Germany,North Rhine-Westfalia,Ruhr Area,,1,2,4,,,2,,0,,15.2,1,102.7,1,,,,2,405.14285,1,3,,,,,,14.411285
230004679,,Germany,North Rhine-Westfalia,Ruhr Area,,1,2,3,,,2,,0,,12.8,1,95.800003,1,,,,2,117.14286,1,3,,,,,,13.946939
230004680,,Germany,North Rhine-Westfalia,Ruhr Area,,1,1,3,,,2,,0,,15.6,1,102.4,1,,,,2,348.21429,1,3,5,Sugar reduced diet,0,,,14.877319
230004681,,Germany,North Rhine-Westfalia,Ruhr Area,,1,2,3,,,2,,0,,18.200001,1,105.8,1,,,,2,607.28571,2,3,0,,0,,,16.259233
230004682,,Germany,North Rhine-Westfalia,Ruhr Area,,1,1,3,,,2,,0,,14.55,1,97,1,,,,2,915.42859,2,3,5,Sugar reduced diet,0,,,15.463918
230004683,,Germany,North Rhine-Westfalia,Ruhr Area,,1,1,3,,,2,,0,,13.8,1,93.900002,1,,,,1,383.57144,1,3,5,Sugar reduced diet,0,,,15.651209
230004684,,Germany,North Rhine-Westfalia,Ruhr Area,,1,1,4,,,2,,0,,15.6,1,99.599998,1,,,,2,794.57141,2,3,,,,,,15.725554
230004685,,Germany,North Rhine-Westfalia,Ruhr Area,,1,1,4,,,2,,0,,19.5,1,112.1,1,,,,2,559.28571,1,3,,,,,,15.517559
230004686,,Germany,North Rhine-Westfalia,Ruhr Area,,1,1,4,,,2,,0,,16.950001,1,104.3,1,,,,2,378.28571,1,3,,,,,,15.581206
230004687,,Germany,North Rhine-Westfalia,Ruhr Area,,1,1,3,,,2,,0,,15.7,1,96.099998,1,,,,2,391.28571,1,3,0,,0,,,17.000154
230004688,,Germany,North Rhine-Westfalia,Ruhr Area,,1,2,3,,,2,,0,,15.17,1,99.599998,1,,,,2,434.57144,1,3,0,,0,,,15.292092
230004689,,Germany,North Rhine-Westfalia,Ruhr Area,,1,2,3,,,2,,0,,14.7,1,96.699997,1,,,,2,716.57141,2,3,5,Sugar reduced diet,0,,,15.720429
230004690,,Germany,North Rhine-Westfalia,Ruhr Area,,1,1,3,,,2,,0,,18.450001,1,99,1,,,,2,375.64285,1,3,0,,0,,,18.82461
230004691,,Germany,North Rhine-Westfalia,Ruhr Area,,1,1,3,,,2,,0,,24.1,1,105,1,,,,2,882.85712,2,3,,,,,,21.859411
230004692,,Germany,North Rhine-Westfalia,Ruhr Area,,1,2,2,,,2,,0,,15.2,1,98.199997,1,,,,2,400.71429,1,3,5,Sugar reduced diet,0,,,15.762338
230004693,,Germany,North Rhine-Westfalia,Ruhr Area,,1,2,3,,,2,,0,,12.3,1,93.900002,1,,,,2,567.85712,1,3,5,Sugar reduced diet,0,,,13.94999